program: Gaussian 09
title: 000108234
version: EM64L-G09RevD.01
frameworkgroup: C1[X(C14H24O)]
method: RPBEPBE
basis: SDD
operation: Freq
keyword: #pfreq=noraman
keyword: PBEPBE/SDD
title: #p freq=noraman PBEPBE/SDD
converged: YES YES NO NO
title: Mulliken charges:
elementType: O C C C C C C C C C C C C C C H H H H H H H H H H H H H H H H H H H H H H H H
charge: -0.217303 -0.379816 -0.385217 -0.373271 -0.379430 -0.353530 -0.380945 -0.356555 -0.427744 -0.696082 -0.186880 -0.188036 -0.173238 -0.256769 -0.121007 0.192315 0.192180 0.193876 0.193955 0.190397 0.190290 0.190179 0.190342 0.187984 0.187834 0.201939 0.201681 0.195228 0.195234 0.219944 0.219846 0.209597 0.216022 0.209651 0.212746 0.252682 0.219735 0.257334 0.154833
chargesum: 0.00000
title: Mulliken charges with hydrogens summed into heavy atoms:
elementType: O C C C C C C C C C C C C C C
charge: -0.217303 0.004678 0.002614 0.007416 0.001091 0.022287 0.022675 0.033907 0.012046 -0.060812 0.025866 0.064646 0.046497 0.000564 0.033826
polarizability: 2.53226309e+02 -4.58855758e+01 1.73357665e+02 7.81355412e-02 5.39947566e-04 1.03253798e+02
1716.lowfreq: -30.8008 -4.2861 -4.0535 -0.0009 0.0010 0.0013 12.0650 21.2620 23.9380
frequency: -20.2360 21.0048 23.7926 59.5786 61.2517 67.6583 84.9894 98.3414 117.9766 119.2414 130.9129 144.9220 158.5439 197.4703 212.9202 221.8680 254.0914 271.8959 324.9208 360.1556 364.9545 419.9325 454.1315 481.3307 552.3360 647.5617 710.9776 719.4180 725.1852 746.9467 786.5643 826.6514 873.1693 886.2591 896.5187 928.7690 947.2307 951.5431 973.5353 988.8520 1010.9716 1017.8790 1019.9278 1040.3757 1066.9698 1077.0959 1078.3745 1090.4816 1102.1342 1120.0962 1139.8505 1181.2599 1184.1894 1198.4289 1214.6351 1215.6864 1246.1516 1247.7807 1270.8068 1277.0429 1278.3415 1280.5174 1285.3556 1291.0069 1293.9883 1299.5580 1308.8584 1316.3715 1339.5746 1351.5857 1353.4169 1364.6213 1383.5996 1388.2235 1439.1584 1459.2468 1459.3304 1463.1228 1466.4677 1472.7118 1475.6200 1478.8482 1484.1394 1487.2477 1578.6840 1621.2496 1652.5776 2851.1615 2937.8116 2948.8707 2949.3654 2951.2127 2954.4892 2960.9560 2967.8933 2969.6807 2970.5257 2971.2237 2983.2362 2988.2314 2996.5647 3009.2326 3022.9140 3035.0322 3043.8230 3067.6589 3070.6252 3070.8546 3076.1117 3123.5919 3131.0202
redmass: 1.6481 3.5430 4.1270 1.9920 4.4977 2.5071 2.3646 2.1537 3.9346 2.0949 2.0821 2.0320 4.3192 3.3248 3.7595 1.1228 1.9660 3.7341 4.7815 3.1058 2.3456 4.3000 3.1958 3.0757 3.8432 3.8589 1.1417 1.0615 1.0893 1.1481 1.2201 1.2844 1.3927 1.9325 1.5071 3.1578 1.1982 1.2683 1.6484 4.6830 1.1394 1.1066 3.4078 3.0765 2.8039 2.2791 2.1326 2.2265 1.3753 2.6989 3.1024 2.6314 1.7997 1.2242 1.4582 1.3599 1.3077 1.3358 1.1809 1.5179 1.0394 1.4073 1.0913 1.1144 1.1018 1.3540 1.3827 1.3421 1.4896 1.6694 1.6647 1.6653 1.2811 1.2168 1.0864 1.0712 1.0727 1.0653 1.0785 1.0793 1.0430 1.0837 1.0911 1.0909 7.2165 5.0362 5.4442 1.0844 1.0599 1.0585 1.0587 1.0590 1.0592 1.0589 1.0588 1.0585 1.0959 1.0366 1.0965 1.0983 1.1009 1.1033 1.1046 1.1048 1.1046 1.1008 1.0992 1.0899 1.0900 1.0904 1.0914
irintensity: 0.2767 0.5969 0.9721 0.0349 1.3162 1.2882 0.0274 1.3234 2.2108 0.2810 0.2271 0.2523 0.8828 8.7202 0.6049 0.0065 0.9508 1.7729 2.8231 1.9221 0.2951 0.2994 0.9271 0.3280 7.9728 19.3636 11.2972 14.1964 1.0210 0.7976 1.5883 0.0734 3.4121 4.3512 0.2421 6.8968 0.5500 0.0061 4.7468 0.4806 2.9138 99.5143 0.4491 2.3761 2.6952 1.0257 0.1462 13.7199 0.2320 5.4508 152.9544 11.7164 0.2533 18.6292 0.9873 9.5390 0.0650 1.0453 0.0239 1.6904 0.1751 1.2754 0.4145 0.0009 0.0195 3.6693 4.8693 1.6692 2.0784 0.1970 0.1511 10.3274 13.6955 11.3372 42.6928 0.2515 0.1259 0.1690 0.0066 3.0564 12.4819 0.8184 7.3375 30.8750 169.5859 337.6876 105.8655 130.4969 13.6054 0.5281 0.1005 3.8186 0.0053 34.4441 37.9919 177.1726 10.0175 37.8343 0.0271 0.0008 0.0019 0.0052 2.4040 6.0875 223.2501 101.3746 54.3525 5.0839 39.5696 15.5662 17.1566
temp: 298.150 k
press: 1.00000 atm
elementType: 8 6 6 6 6 6 6 6 6 6 6 6 6 6 6 1 1 1 1 1 1 1 1 1 1 1 1 1 1 1 1 1 1 1 1 1 1 1 1
symmnumber: 1
zpe: 901619.7 jmol-1
zpe.correction: 0.343409 hartree
zpe.thermalcorrener: 0.361694 hartree
zpe.thermalcorrenthalpy: 0.362638 hartree
zpe.thermalcorrgfe: 0.294015 hartree
zpe.sumelectzpe: -621.873184 hartree
zpe.sumelectthermal: -621.854899 hartree
zpe.sumelectthermalent: -621.853955 hartree
zpe.sumelectthermalfe: -621.922578 hartree
dipole: -4.7424 4.1177 -0.0081
dipole: 6.2806
quadrupole: -142.3552 -98.3363 -95.5977
quadrupole: 29.0512 -0.0265 -0.0135
quadrupole: -30.2588 13.7601 16.4987 29.0512 -0.0265 -0.0135
hfenergy: -622.2165925 hartree
pointgroup: C01 [X(C14H24O1)]
dipole: 1.8723942 1.6122738 0.0188157 debye
polarizability: 253.5992674|45.5521115|172.9784347|0.8315888|0.5624104|103.26007 unknown
InChI: InChI=1S/C14H24O/c1-2-3-4-5-6-7-8-9-10-11-12-13-14-15/h10-14H,2-9H2,1H3
charge 0 multiplicity 1
39 atoms
O  -7.530322 -2.231927 -0.04611
C  3.538752 0.560379 0.002348
C  2.058005 0.118896 0.01409
C  4.530123 -0.625506 0.021378
C  1.068051 1.305669 0.006019
C  6.011225 -0.185398 0.001333
C  -0.41207 0.86237 0.006466
C  7.00218 -1.372208 0.028911
C  -1.3859 2.059621 0.007993
C  8.479442 -0.923834 0.005459
C  -2.858708 1.72918 0.001019
C  -3.412818 0.474655 -0.008053
C  -4.847116 0.245324 -0.016144
C  -5.450042 -0.992986 -0.027058
C  -6.909242 -1.129154 -0.035477
H  3.729246 1.181958 -0.897614
H  3.734007 1.214028 0.878282
H  1.861637 -0.528307 -0.866191
H  1.869616 -0.509074 0.909889
H  4.331518 -1.282913 -0.8510
H  4.343729 -1.243641 0.924582
H  1.260968 1.94793 0.890899
H  1.262887 1.937828 -0.885679
H  6.201109 0.427207 -0.90497
H  6.210632 0.476172 0.870459
H  -0.603733 0.226934 0.894956
H  -0.603994 0.228634 -0.883167
H  6.800573 -2.034052 -0.838078
H  6.812952 -1.982036 0.935891
H  -1.176486 2.703419 0.890816
H  -1.170186 2.710806 -0.867914
H  8.71277 -0.284013 0.877621
H  9.167535 -1.788932 0.027355
H  8.701095 -0.33852 -0.907068
H  -3.541849 2.594638 0.002851
H  -2.763661 -0.410457 -0.010039
H  -5.493627 1.138844 -0.013687
H  -4.859761 -1.918517 -0.030182
H  -7.470535 -0.157617 -0.031984
