program: Gaussian 09
title: 000008569
version: EM64L-G09RevD.01
frameworkgroup: C1[X(C14H12O4)]
method: RPBEPBE
basis: SDD
operation: Freq
keyword: #pfreq=noraman
keyword: PBEPBE/SDD
title: #p freq=noraman PBEPBE/SDD
converged: YES YES NO NO
title: Mulliken charges:
elementType: O O O O C C C C C C C C C C C C C C H H H H H H H H H H H H
charge: -0.264155 -0.394481 -0.199650 -0.424057 0.269940 0.165114 0.032605 0.183210 -0.306548 0.367954 -0.561643 0.179338 -0.405491 -0.336043 -0.395677 -0.258765 -0.203302 -0.535923 0.244506 0.243787 0.242387 0.270254 0.217049 0.232551 0.229569 0.356658 0.356252 0.246430 0.223036 0.225097
chargesum: 0.00000
title: Mulliken charges with hydrogens summed into heavy atoms:
elementType: O O O O C C C C C C C C C C C C C C
charge: -0.264155 -0.037823 -0.199650 -0.067804 0.269940 0.165114 0.032605 0.183210 -0.062042 0.367954 -0.317856 0.179338 -0.163104 -0.065789 -0.178628 -0.026215 0.026267 0.158639
polarizability: 2.47512074e+02 4.20359727e-01 1.63357981e+02 -1.76503494e+01 -4.37247427e+00 1.10145549e+02
1716.lowfreq: -5.6382 -0.0008 -0.0003 0.0000 4.3397 9.7597 30.5934 39.7824 49.0195
frequency: 30.5709 39.7035 48.9930 90.5616 104.8893 138.1769 162.6014 212.5161 215.5586 224.3123 230.3725 263.5822 292.6625 324.9555 348.1627 356.2674 369.9722 414.7495 429.4466 454.5753 494.8181 511.8255 539.0197 547.5050 560.9195 597.6229 629.1051 659.9031 674.5398 716.6076 733.5966 754.4088 774.6658 802.5870 810.5276 835.2272 848.1662 879.8903 927.2392 945.1693 948.3945 980.9880 1007.4685 1041.2226 1070.5543 1096.0917 1111.9965 1145.8262 1152.8180 1155.7282 1162.5877 1172.7112 1185.3511 1239.6852 1266.9142 1279.6902 1290.7175 1299.3226 1388.5166 1395.6734 1418.9215 1430.9684 1437.1315 1466.3313 1472.7297 1483.1165 1504.7270 1543.4938 1588.0126 1595.5362 1608.7955 1620.7057 2965.0428 3055.0801 3111.0678 3128.3169 3138.7060 3139.8569 3140.8157 3152.1996 3170.6227 3173.4451 3563.4840 3570.0095
redmass: 6.0700 5.2193 4.9737 3.9912 5.1991 5.0020 4.5155 6.4596 1.5205 3.8557 3.1286 4.6811 4.2082 4.4305 2.1645 1.4427 1.4119 4.4892 3.7108 3.1174 5.8484 3.7883 6.3961 5.3343 5.3004 6.4396 3.8614 5.4358 3.6786 5.7879 3.3494 1.4734 1.9924 2.4922 3.9834 1.8035 1.5638 5.7116 5.0689 1.3937 1.4615 1.3419 3.7192 2.2907 2.5937 2.1426 1.2585 1.4638 1.2598 1.6538 1.6102 1.0695 1.6894 2.7708 3.3320 2.3924 1.4650 1.7964 7.3381 6.1817 4.1492 2.3826 1.2328 1.0503 1.0637 2.4685 2.7668 10.7377 7.2221 6.6488 6.6691 6.8174 1.0327 1.1042 1.0885 1.0998 1.0910 1.0879 1.0895 1.0931 1.1002 1.0946 1.0659 1.0660
irintensity: 2.6583 0.1985 1.3375 1.5963 5.3563 1.3982 1.3574 0.1646 0.7663 5.0640 1.2435 5.5125 6.9317 15.0470 41.3991 69.2066 108.3709 9.8160 0.8755 15.0449 31.7648 16.9691 1.4511 9.8860 3.3025 31.9312 16.6449 0.8576 17.5161 3.9464 6.7181 91.2802 10.8144 1.9836 27.0723 57.1127 1.0693 44.9742 44.8365 0.2997 5.1952 2.2748 37.8451 5.5834 72.4555 256.8117 0.1582 9.8337 15.8714 95.9801 58.0144 2.9763 78.2347 31.5846 275.5813 71.8915 41.4885 144.4055 12.4292 4.7545 28.7094 81.7447 0.8140 14.2402 42.2287 13.2178 34.4290 179.1306 135.6921 38.5580 66.2312 313.6516 66.9298 44.5016 12.2713 26.5247 10.8257 7.1234 1.9469 10.0487 26.0193 9.6048 31.5065 31.6220
temp: 298.150 k
press: 1.00000 atm
elementType: 8 8 8 8 6 6 6 6 6 6 6 6 6 6 6 6 6 6 1 1 1 1 1 1 1 1 1 1 1 1
symmnumber: 1
zpe: 591358.1 jmol-1
zpe.correction: 0.225236 hartree
zpe.thermalcorrener: 0.241580 hartree
zpe.thermalcorrenthalpy: 0.242524 hartree
zpe.thermalcorrgfe: 0.180728 hartree
zpe.sumelectzpe: -840.273234 hartree
zpe.sumelectthermal: -840.256891 hartree
zpe.sumelectthermalent: -840.255947 hartree
zpe.sumelectthermalfe: -840.317743 hartree
dipole: -1.6322 -5.8081 1.1950
dipole: 6.1503
quadrupole: -83.7698 -98.4764 -98.3592
quadrupole: -6.7313 1.0413 0.9183
quadrupole: 9.7653 -4.9413 -4.8240 -6.7313 1.0413 0.9183
hfenergy: -840.4984708 hartree
pointgroup: C01 [X(C14H12O4)]
dipole: -0.4603257 2.0060628 -1.2723626 debye
polarizability: 243.9961743|4.1672137|153.9639643|27.0088711|-20.8132923|123.0554654 unknown
InChI: InChI=1S/C14H12O4/c1-18-9-6-7-11(13(16)8-9)14(17)10-4-2-3-5-12(10)15/h2-8,15-16H,1H3
charge 0 multiplicity 1
30 atoms
O  -4.501292 0.893083 -0.510009
O  -1.430916 -2.762253 0.102175
O  0.883403 -2.024932 1.57391
O  1.268342 0.297422 -1.750568
C  -0.595583 -0.504524 0.412838
C  1.979205 -0.175413 0.521272
C  0.746433 -0.989822 0.853161
C  -1.681687 -1.388658 0.119714
C  -0.858357 0.886934 0.362325
C  -3.189235 0.512962 -0.20336
C  -2.960496 -0.882229 -0.188779
C  2.233238 0.435548 -0.739677
C  -2.130487 1.415128 0.072473
C  2.993803 -0.100048 1.511982
C  3.448539 1.125615 -0.977346
C  4.201227 0.590092 1.289116
C  4.424875 1.209377 0.036365
C  -4.804779 2.327092 -0.537156
H  -0.034529 1.575865 0.577669
H  -3.797739 -1.549813 -0.423679
H  -2.28394 2.49709 0.066209
H  2.805279 -0.611715 2.461676
H  3.632588 1.585458 -1.95774
H  4.960565 0.642881 2.075519
H  5.359522 1.747356 -0.156585
H  -2.249893 -3.262067 -0.143643
H  1.586472 0.705424 -2.594406
H  -5.873573 2.388419 -0.788376
H  -4.208388 2.849065 -1.309924
H  -4.625099 2.793764 0.450346
