program: Gaussian 09
title: 000107152
version: EM64L-G09RevD.01
frameworkgroup: C1[X(C15H24)]
method: RPBEPBE
basis: SDD
operation: Freq
keyword: #p
keyword: freq=noraman
keyword: PBEPBE/SDD
title: #p freq=noraman PBEPBE/SDD
converged: YES YES NO NO
title: Mulliken charges:
elementType: C C C C C C C C C C C C C C C H H H H H H H H H H H H H H H H H H H H H H H H
charge: 0.305609 0.220042 -0.251193 -0.157430 -0.634987 -0.586612 -0.144701 -0.470937 -0.444850 -0.463829 -0.735374 -0.753555 0.554882 -0.846874 -0.779672 0.219077 0.193284 0.209442 0.228702 0.220811 0.220409 0.200506 0.206347 0.221774 0.194391 0.204856 0.211980 0.201265 0.220784 0.223287 0.217067 0.221733 0.215128 0.219305 0.235714 0.235653 0.225211 0.216616 0.226140
chargesum: 0.00000
title: Mulliken charges with hydrogens summed into heavy atoms:
elementType: C C C C C C C C C C C C C C C
charge: 0.305609 0.220042 -0.032116 0.035854 -0.196844 -0.145392 0.055805 -0.042816 -0.045603 -0.050585 -0.074236 -0.097389 0.554882 -0.150295 -0.336916
polarizability: 1.75852136e+02 -1.09787797e+01 1.57434600e+02 -3.25560905e+00 3.16583433e+00 1.35061010e+02
1716.lowfreq: -9.0868 -0.0005 -0.0003 0.0005 7.9906 16.0655 39.1709 58.3843 69.3142
frequency: 38.7800 57.8143 69.2000 87.7296 107.8606 131.7781 175.5923 197.6047 213.3848 218.2720 232.5662 242.4276 247.7697 301.6505 309.1563 331.3446 365.0474 386.9873 454.2369 469.8962 487.8852 527.1315 536.5146 595.1754 641.0759 682.5459 711.7152 724.7607 766.8673 803.4386 815.7053 853.6064 870.2659 886.7222 914.3237 931.9206 936.6442 954.5713 965.2654 981.7843 995.7583 1006.3367 1020.1320 1025.8826 1046.9438 1053.0224 1062.0558 1092.5816 1098.1541 1109.6957 1119.4807 1150.8836 1167.9857 1170.5942 1195.2276 1215.3916 1230.7948 1243.8283 1271.3537 1279.1820 1287.2438 1297.7793 1303.5518 1308.3153 1311.4800 1319.9407 1326.0181 1345.9172 1361.6946 1370.4096 1378.7630 1386.5200 1394.7174 1429.6039 1456.4000 1458.8299 1461.2221 1467.9084 1469.4181 1471.9244 1473.3562 1477.5006 1478.3309 1479.1246 1489.0190 1659.3353 1681.3464 2938.5750 2945.0475 2948.7431 2961.1736 2963.6003 2967.5880 2969.8442 2971.8247 2976.0168 2981.9708 2995.0945 3005.9702 3009.0988 3014.7092 3028.0130 3044.3722 3058.5481 3065.4873 3065.7403 3068.3960 3079.7350 3081.1062 3082.5725 3183.8519
redmass: 2.6263 2.7130 2.7877 2.9412 2.4460 2.8532 1.0868 2.2749 1.9643 3.1954 1.0686 1.5245 2.0853 2.7638 2.5578 2.0412 2.5194 2.3031 2.5469 2.5171 2.7579 2.7708 2.5883 2.8425 2.4072 2.5995 1.6206 1.8533 2.0914 2.1326 2.2982 2.3048 2.0325 2.0246 2.0596 1.8335 1.3708 1.5179 1.7056 1.9014 1.6386 2.0069 1.6175 1.7757 1.5699 1.6336 1.9372 1.8445 2.0575 3.0802 1.9837 1.5297 1.8510 1.5463 1.4080 1.4011 1.3854 1.2943 1.5016 1.7500 1.7062 1.3772 1.6227 1.4174 1.3232 1.3427 1.5566 1.5829 1.4774 1.4116 1.2039 1.3655 1.2291 1.1909 1.0833 1.0785 1.0757 1.0649 1.0584 1.0729 1.0560 1.0772 1.0626 1.0596 1.0657 4.9903 7.7793 1.0645 1.0678 1.0715 1.0822 1.0650 1.0352 1.0452 1.0501 1.0458 1.0779 1.0802 1.0958 1.0775 1.0997 1.1010 1.0962 1.1031 1.1003 1.0992 1.1004 1.0987 1.0631 1.0984 1.1137
irintensity: 0.1307 0.0230 0.1225 0.0891 0.0967 0.2701 0.4802 0.7868 0.1413 0.1102 0.0260 0.3066 0.4211 0.4399 0.5536 1.7328 0.5783 0.1761 2.9606 1.6590 2.9077 3.1240 6.5949 1.7686 1.2758 0.1206 0.1180 1.5273 3.4364 2.0935 3.0239 0.3070 2.2188 0.9362 4.2562 1.4247 81.1948 3.4546 0.6252 0.1576 11.0295 1.8600 10.4929 5.4368 4.8977 1.2784 0.9291 1.2770 2.0039 5.2921 1.6161 0.0536 5.1833 2.4670 0.6264 3.7542 3.5831 5.5941 2.6544 2.1834 0.9662 1.0323 3.9474 6.2318 1.0931 0.4163 1.1717 1.6530 2.7910 6.7246 6.3563 19.3222 32.9233 0.4636 10.9734 5.6340 4.9195 7.4260 8.4815 3.3103 9.1191 6.4846 20.8760 9.3317 10.0107 32.9003 0.6245 18.9569 23.8779 39.2419 26.9228 51.1196 33.0785 54.0017 10.8060 47.6989 28.7036 25.3088 35.6388 70.2124 26.3675 71.8934 22.3506 24.9352 56.2761 54.7818 43.7740 57.3972 11.4510 25.3137 29.1372
temp: 298.150 k
press: 1.00000 atm
elementType: 6 6 6 6 6 6 6 6 6 6 6 6 6 6 6 1 1 1 1 1 1 1 1 1 1 1 1 1 1 1 1 1 1 1 1 1 1 1 1
symmnumber: 1
zpe: 918343.6 jmol-1
zpe.correction: 0.349779 hartree
zpe.thermalcorrener: 0.365990 hartree
zpe.thermalcorrenthalpy: 0.366934 hartree
zpe.thermalcorrgfe: 0.306709 hartree
zpe.sumelectzpe: -584.784166 hartree
zpe.sumelectthermal: -584.767955 hartree
zpe.sumelectthermalent: -584.767011 hartree
zpe.sumelectthermalfe: -584.827236 hartree
dipole: -0.3321 0.4400 0.4963
dipole: 0.7418
quadrupole: -94.4606 -93.5673 -93.6508
quadrupole: -0.3156 2.3078 -0.1833
quadrupole: -0.5677 0.3256 0.2421 -0.3156 2.3078 -0.1833
hfenergy: -585.133945 hartree
pointgroup: C01 [X(C15H24)]
dipole: -0.1323351 0.1746633 0.1927595 debye
polarizability: 175.8684393|-11.0687779|157.5205813|-2.7507631|2.9108005|134.9587258 unknown
InChI: InChI=1S/C15H24/c1-10(2)13-7-5-11(3)14-8-6-12(4)15(14)9-13/h11-13H,1,5-9H2,2-4H3
charge 0 multiplicity 1
39 atoms
C  -0.899748 -0.569663 -0.028377
C  -1.511581 0.630518 -0.258629
C  -1.886301 -1.737497 -0.162131
C  -0.94727 2.034284 -0.083405
C  0.527417 -0.837849 0.414859
C  -2.985973 0.437588 -0.614375
C  1.634387 -0.071945 -0.376377
C  -3.110975 -1.091185 -0.884025
C  0.467025 2.248216 -0.695304
C  1.642272 1.456189 -0.073582
C  -2.246609 -2.337202 1.225132
C  -1.006818 2.462382 1.412496
C  3.013225 -0.69071 -0.120148
C  3.550868 -0.66018 1.302129
C  3.731623 -1.243832 -1.134438
H  -1.450176 -2.551946 -0.777261
H  -1.619621 2.725263 -0.635888
H  0.639867 -0.603847 1.495647
H  0.727914 -1.923664 0.318281
H  -3.637449 0.766033 0.224048
H  -3.286176 1.04334 -1.492251
H  1.411879 -0.194753 -1.456317
H  -4.072234 -1.511815 -0.536948
H  -3.039199 -1.27736 -1.971739
H  0.702101 3.329907 -0.613338
H  0.42068 2.017373 -1.779103
H  2.584888 1.879093 -0.475547
H  1.674092 1.618938 1.022623
H  -1.345487 -2.701531 1.753341
H  -2.728502 -1.574026 1.864806
H  -2.943377 -3.189627 1.11838
H  -0.385091 1.80356 2.044516
H  -0.646788 3.501288 1.539548
H  -2.042402 2.41087 1.795252
H  3.640005 0.377699 1.676626
H  2.877033 -1.194146 1.999554
H  4.546612 -1.13173 1.363671
H  4.721467 -1.685909 -0.967684
H  3.348019 -1.268223 -2.161843
