program: Gaussian 09
title: 000107062
version: EM64L-G09RevD.01
frameworkgroup: C1[X(C9H14Cl2O2)]
method: RPBEPBE
basis: SDD
operation: Freq
keyword: #p
keyword: freq=noraman
keyword: PBEPBE/SDD
title: #p freq=noraman PBEPBE/SDD
converged: NO YES NO NO
title: Mulliken charges:
elementType: Cl Cl O O C C C C C C C C C H H H H H H H H H H H H H H
charge: 0.071417 0.050143 -0.214817 -0.156419 -0.019990 -0.419036 -0.419011 -0.364732 -0.512945 -0.354100 0.314708 -0.358369 -0.694455 0.260352 0.210824 0.219977 0.284452 0.264180 0.188849 0.231477 0.194379 0.185329 0.196155 0.202023 0.211459 0.219161 0.208989
chargesum: 0.00000
title: Mulliken charges with hydrogens summed into heavy atoms:
elementType: Cl Cl O O C C C C C C C C C
charge: 0.071417 0.050143 -0.214817 -0.156419 0.240362 0.011765 0.129621 0.055595 -0.512945 0.025608 0.314708 0.039809 -0.054847
polarizability: 1.54139562e+02 -6.13552834e+00 1.07043462e+02 -2.60451849e-01 3.44599279e+00 1.04086278e+02
1716.lowfreq: -6.6594 -0.9977 0.0025 0.0027 0.0030 11.9658 29.9968 46.1835 51.0411
frequency: 29.9833 46.1320 50.9047 88.7333 105.6719 124.2415 136.3497 160.5805 185.2500 197.7360 216.5549 231.5722 285.4624 309.3988 342.5876 391.1211 458.4790 477.7281 531.5006 560.4757 610.4437 669.5848 722.9813 725.5314 750.4160 810.2540 844.7656 889.5759 894.3860 934.3751 983.3823 992.8276 1030.0391 1046.5676 1056.1567 1080.2276 1082.6836 1120.7323 1128.0460 1150.3527 1189.3678 1206.8497 1234.3493 1259.4695 1273.6208 1289.1885 1292.7645 1307.7631 1311.9125 1340.5922 1357.3657 1370.7452 1390.2347 1437.5993 1447.1587 1464.5935 1469.7519 1477.4381 1479.8113 1488.0430 1716.5893 2953.7461 2967.1022 2970.1179 2973.5660 2974.4354 2996.1658 3015.5509 3023.1837 3027.3140 3035.5347 3054.9643 3070.2327 3074.0580 3117.5008
redmass: 5.3943 4.8845 1.7091 3.6910 4.4697 1.9740 3.3536 10.7770 7.3093 3.4484 9.3021 1.1190 9.1470 3.4009 3.0314 5.9713 3.0979 2.9909 5.8003 5.9273 4.3171 6.9983 4.4967 1.1420 1.2144 2.4767 1.6091 4.1785 2.4169 1.4029 1.6154 4.4607 3.5783 2.4623 3.7043 2.0250 2.4768 2.5156 4.2285 1.9386 1.4344 1.4321 1.2837 1.2547 1.3252 1.0554 1.1506 1.3538 1.1983 1.4165 1.6118 1.7010 1.2172 1.0892 1.0831 1.0680 1.0743 1.0430 1.0704 1.0874 12.9805 1.0590 1.0613 1.0595 1.0369 1.0636 1.0962 1.0901 1.0929 1.0754 1.0911 1.1024 1.1009 1.0992 1.1010
irintensity: 0.6317 1.1091 0.0542 0.0974 0.4523 0.2621 0.0345 4.1783 1.3175 0.1215 1.4308 0.0008 1.1977 1.4315 0.2801 4.2453 2.2603 4.1526 31.0114 33.3274 5.7437 17.2628 18.9809 21.8531 5.3193 19.8405 13.0049 74.9505 57.5526 24.8377 20.4413 16.3209 96.7090 7.4770 18.8959 5.0457 2.9561 29.1267 89.0667 19.7533 2.0735 1.5479 9.4172 0.5156 3.0896 1.0161 4.8869 4.1562 5.6427 12.6434 1.4318 7.0146 11.7971 4.3769 14.4476 0.1357 1.0559 12.5408 4.6679 20.6773 280.9367 10.8078 6.0527 9.7617 39.3474 88.8881 6.7328 0.1828 15.5363 5.1344 9.4411 57.0858 100.1638 50.6489 3.6343
temp: 298.150 k
press: 1.00000 atm
elementType: 17 17 8 8 6 6 6 6 6 6 6 6 6 1 1 1 1 1 1 1 1 1 1 1 1 1 1
symmnumber: 1
zpe: 565310.1 jmol-1
zpe.correction: 0.215315 hartree
zpe.thermalcorrener: 0.230143 hartree
zpe.thermalcorrenthalpy: 0.231087 hartree
zpe.thermalcorrgfe: 0.171375 hartree
zpe.sumelectzpe: -1420.892943 hartree
zpe.sumelectthermal: -1420.878115 hartree
zpe.sumelectthermalent: -1420.877171 hartree
zpe.sumelectthermalfe: -1420.936883 hartree
dipole: 3.5993 -3.2824 3.1177
dipole: 5.7835
quadrupole: -100.0900 -96.1669 -93.9468
quadrupole: 3.8528 -4.1394 3.7659
quadrupole: -3.3555 0.5677 2.7878 3.8528 -4.1394 3.7659
hfenergy: -1421.1082582 hartree
pointgroup: C01 [X(C9H14Cl2O2)]
dipole: -1.4744879 -1.7330329 -0.0030803 debye
polarizability: 154.3634627|2.5433259|101.9792808|-4.4735619|-1.5207597|108.926558 unknown
InChI: InChI=1S/C9H14Cl2O2/c1-2-3-4-5-7-6-9(10,11)8(12)13-7/h7H,2-6H2,1H3
charge 0 multiplicity 1
27 atoms
Cl 4.092078 -0.563051 -1.314972
Cl 3.430343 -0.579835 1.667325
O  0.720313 0.896642 0.105495
O  2.641965 2.13824 -0.33334
C  0.373081 -0.56342 0.338163
C  -0.991799 -0.839218 -0.288307
C  1.563569 -1.329881 -0.287995
C  -2.146262 -0.066016 0.387044
C  2.731147 -0.368524 -0.080306
C  -3.508938 -0.32591 -0.29222
C  2.09688 1.051025 -0.128184
C  -4.674488 0.433554 0.381501
C  -6.032416 0.182823 -0.308568
H  0.350338 -0.694158 1.436204
H  -1.18218 -1.930701 -0.221597
H  -0.946291 -0.585086 -1.365843
H  1.735926 -2.313812 0.17234
H  1.396099 -1.460789 -1.372674
H  -2.207509 -0.353974 1.457193
H  -1.917668 1.016619 0.363144
H  -3.450495 -0.028428 -1.359938
H  -3.729084 -1.414377 -0.283165
H  -4.738173 0.133263 1.447236
H  -4.450818 1.519508 0.377294
H  -6.004195 0.503782 -1.366904
H  -6.847721 0.737711 0.190401
H  -6.295203 -0.891788 -0.290929
