program: Gaussian 09
title: 000107052
version: EM64L-G09RevD.01
frameworkgroup: C1[X(C17H28O)]
method: RPBEPBE
basis: SDD
operation: Freq
keyword: #pfreq=noraman
keyword: PBEPBE/SDD
title: #p freq=noraman PBEPBE/SDD
converged: NO YES NO NO
title: Mulliken charges:
elementType: O C C C C C C C C C C C C C C C C C H H H H H H H H H H H H H H H H H H H H H H H H H H H H
charge: -0.218144 0.407344 0.347539 -0.199474 -0.097707 -0.612221 -0.546674 -0.470428 -0.651546 -0.795064 -0.803874 -0.797506 -0.140947 -0.470013 0.185144 -0.405626 -0.521924 -0.395301 0.237645 0.214024 0.220836 0.252349 0.202827 0.225632 0.202441 0.226965 0.225115 0.209072 0.210620 0.209667 0.229316 0.208494 0.216320 0.239389 0.220734 0.231104 0.218934 0.249513 0.206595 0.215084 0.215037 0.210365 0.221824 0.241419 0.214061 0.211041
chargesum: 0.00000
title: Mulliken charges with hydrogens summed into heavy atoms:
elementType: O C C C C C C C C C C C C C C C C C
charge: -0.218144 0.407344 0.347539 0.038171 0.116317 -0.139035 -0.118215 -0.041023 -0.217359 -0.145461 -0.139672 -0.126734 0.108567 -0.048334 0.185144 0.019776 -0.058681 0.029800
polarizability: 1.89433295e+02 6.75626709e-01 1.66316623e+02 4.30661979e+00 1.62162085e+00 1.63038983e+02
1716.lowfreq: -0.0007 -0.0003 0.0007 7.5025 13.5105 22.4186 39.3650 62.1526 85.8210
frequency: 37.4562 61.9521 85.7686 103.4809 121.8374 130.3856 171.2927 196.6886 204.9848 214.3748 226.3366 250.7616 266.5610 273.9726 309.6343 325.2267 341.7368 380.3497 387.2342 401.7781 411.5685 425.7707 446.1243 461.0241 492.4740 519.1329 546.8263 588.4778 606.3259 669.3506 677.0811 703.3070 724.8462 783.2649 803.2799 824.2466 833.2363 846.2729 859.7377 874.3044 897.0383 912.0590 916.2316 922.5001 939.8335 943.0352 958.3966 974.3214 982.8377 988.1302 992.2244 1024.2209 1036.2446 1044.1512 1054.9894 1070.7558 1089.3478 1101.1360 1107.4770 1109.6881 1128.5399 1135.1896 1148.1840 1166.0704 1186.2037 1203.4653 1212.3180 1215.4073 1228.1006 1235.8125 1239.6989 1253.7484 1262.0761 1268.8922 1273.2755 1278.2311 1293.7438 1299.5897 1302.0114 1305.4830 1325.1725 1329.3953 1339.4905 1343.9127 1351.4253 1355.5837 1377.2243 1391.2272 1397.8963 1450.2022 1461.5025 1464.8822 1465.6350 1468.4666 1471.8670 1476.6245 1477.9758 1481.9864 1484.9818 1485.1570 1497.9477 1500.8227 1502.5944 1621.8465 2966.9365 2968.5285 2970.9827 2973.1640 2975.9287 2979.5725 2979.9898 2980.8079 2983.5968 2988.4427 2994.4528 3003.3219 3013.6345 3026.2888 3030.8954 3037.1228 3038.7129 3045.7823 3046.6544 3049.1254 3051.7406 3053.3012 3059.2336 3073.4236 3074.6545 3086.6991 3092.7959 3108.5869
redmass: 4.0310 3.3331 3.6992 4.9679 2.0166 3.8913 2.1251 1.3241 1.3346 1.5054 2.0878 1.9477 2.1606 2.1680 2.2642 1.9832 1.9905 2.1617 2.5421 2.9379 2.1692 2.7160 2.7623 2.6585 2.7790 3.2744 2.5376 2.8820 3.3973 3.3503 3.3448 2.9718 2.7401 1.7497 1.4613 2.1903 2.8011 2.5524 1.9120 1.9646 1.9783 2.1394 1.5096 1.7376 1.4666 1.8579 2.3686 1.8534 1.9198 1.5800 1.6825 2.2715 1.7899 1.5524 1.5338 1.4008 1.6968 1.7046 2.0456 2.1700 1.4266 2.0354 2.0490 1.8401 1.7174 1.5500 1.5895 1.9242 1.8190 1.4584 1.8560 1.5133 1.5418 1.7433 1.4949 1.3063 1.4276 1.4202 1.5597 1.6622 1.3453 1.4798 1.4609 1.4508 1.3190 1.4389 1.2077 1.2025 1.1942 1.0910 1.0643 1.0852 1.0586 1.0768 1.0733 1.0924 1.0581 1.0680 1.0701 1.0580 1.0619 1.0810 1.0535 8.8711 1.0587 1.0601 1.0387 1.0768 1.0392 1.0648 1.0453 1.0599 1.0647 1.0641 1.0621 1.0637 1.0942 1.0988 1.0906 1.0986 1.0889 1.1000 1.1018 1.1025 1.1002 1.0983 1.0978 1.0981 1.1001 1.0976 1.0961 1.0934
irintensity: 1.0401 0.8677 1.6401 3.4423 0.0665 0.3490 0.1701 0.0673 0.1992 0.1528 0.1700 0.5885 0.2564 0.3702 0.3389 0.0978 0.2736 0.2751 0.2775 2.2552 0.2498 0.8699 3.7632 0.5612 6.7145 0.3388 0.8546 2.7559 0.9408 1.0154 0.5386 0.2937 2.4445 1.5056 11.9153 1.3835 0.2192 0.6756 7.1596 3.2647 1.6845 0.7761 6.5344 10.8319 1.8057 6.7736 4.3862 5.9158 3.8380 0.3716 5.0195 5.6223 6.0452 1.4446 5.5373 6.0901 1.2026 2.0094 18.1085 1.6940 0.8278 0.6229 2.6285 1.8873 5.2641 1.9380 7.9688 2.1281 3.9490 0.9261 3.3995 9.9239 8.0756 0.3313 3.1805 3.1045 2.3282 18.1362 9.2721 2.7489 1.9554 1.0274 3.9126 0.0069 0.9111 3.3188 10.5219 22.3006 23.4591 11.8516 4.7331 14.3394 4.6868 18.0527 6.4820 7.9861 0.3042 9.6963 10.0624 6.2865 2.1224 10.0061 7.9737 135.7123 8.7320 34.3646 16.1614 22.9383 60.2874 5.1007 35.3676 45.0628 47.4363 39.9679 36.2354 45.3471 6.1587 31.8346 83.0726 32.4938 46.6512 11.7364 11.4446 78.3194 51.8110 45.0424 43.6471 21.9308 49.4111 48.5521 38.8912 23.8518
temp: 298.150 k
press: 1.00000 atm
elementType: 8 6 6 6 6 6 6 6 6 6 6 6 6 6 6 6 6 6 1 1 1 1 1 1 1 1 1 1 1 1 1 1 1 1 1 1 1 1 1 1 1 1 1 1 1 1
symmnumber: 1
zpe: 1085415.6 jmol-1
zpe.correction: 0.413413 hartree
zpe.thermalcorrener: 0.431319 hartree
zpe.thermalcorrenthalpy: 0.432263 hartree
zpe.thermalcorrgfe: 0.369317 hartree
zpe.sumelectzpe: -738.393482 hartree
zpe.sumelectthermal: -738.375576 hartree
zpe.sumelectthermalent: -738.374632 hartree
zpe.sumelectthermalfe: -738.437578 hartree
dipole: 0.1344 1.6297 2.7651
dipole: 3.2125
quadrupole: -108.0422 -114.2134 -117.8935
quadrupole: 3.6622 6.7154 -5.2821
quadrupole: 5.3408 -0.8303 -4.5105 3.6622 6.7154 -5.2821
hfenergy: -738.806895 hartree
pointgroup: C01 [X(C17H28O1)]
dipole: 0.0497614 -0.7131432 -1.0422734 debye
polarizability: 189.3807916|-0.8106442|166.5097121|-4.4541055|1.3637813|162.8983971 unknown
InChI: InChI=1S/C17H28O/c1-12-10-14-8-9-17(12,16(14,2)3)11-13-6-4-5-7-15(13)18/h12-14H,4-11H2,1-3H3
charge 0 multiplicity 1
46 atoms
O  2.188532 1.496104 1.821514
C  -0.897226 -0.003134 0.040915
C  -2.062455 0.009298 -1.050794
C  -3.095276 0.659483 -0.062933
C  -1.560771 -0.731518 1.281825
C  -0.860625 1.512702 0.450037
C  -3.078193 -0.321054 1.145763
C  -2.365395 1.959552 0.384148
C  0.447753 -0.577398 -0.442475
C  -2.507814 -1.36994 -1.600618
C  -1.749336 0.884326 -2.29341
C  -1.344368 -2.255432 1.428239
C  1.623295 -0.545984 0.590457
C  2.750703 -1.555553 0.193893
C  2.26893 0.838149 0.747816
C  3.535592 -1.108497 -1.061896
C  3.09074 1.339373 -0.439806
C  4.164526 0.287968 -0.850579
H  -4.101632 0.83042 -0.484783
H  -1.145095 -0.26973 2.199764
H  -0.236661 2.103188 -0.247332
H  -0.424351 1.648868 1.453405
H  -3.462024 0.162478 2.062752
H  -3.712607 -1.207678 0.959874
H  -2.739185 2.318555 1.360024
H  -2.515059 2.777548 -0.343584
H  0.747817 -0.049124 -1.368867
H  0.301559 -1.638767 -0.730289
H  -3.262556 -1.22503 -2.397332
H  -1.656513 -1.912506 -2.055265
H  -2.959622 -2.025679 -0.841196
H  -1.031601 0.369439 -2.960859
H  -2.673908 1.051358 -2.878502
H  -1.327819 1.872025 -2.046967
H  -1.914144 -2.627835 2.301068
H  -1.680647 -2.825434 0.545845
H  -0.281042 -2.504966 1.602435
H  1.22929 -0.824109 1.585642
H  2.295626 -2.552776 0.033548
H  3.458811 -1.656958 1.041603
H  2.862409 -1.08566 -1.941452
H  4.328492 -1.84685 -1.288625
H  2.414929 1.514548 -1.301327
H  3.55237 2.304191 -0.168238
H  4.681032 0.628086 -1.767936
H  4.93062 0.227853 -0.051804
