program: Gaussian 09
title: 000107022
version: EM64L-G09RevD.01
frameworkgroup: C1[X(C10H19ClO3)]
method: RPBEPBE
basis: SDD
operation: Freq
keyword: #p
keyword: freq=noraman
keyword: PBEPBE/SDD
title: #p freq=noraman PBEPBE/SDD
converged: YES YES NO NO
title: Mulliken charges:
elementType: Cl O O O C C C C C C C C C C H H H H H H H H H H H H H H H H H H H
charge: -0.055734 -0.284599 -0.256312 -0.232457 -0.080221 -0.226338 -0.011399 -0.247829 -0.692040 -0.701955 -0.699906 0.359091 -0.466777 -0.630648 0.212294 0.185706 0.178926 0.232984 0.213673 0.182520 0.208175 0.196171 0.247648 0.221941 0.211416 0.205723 0.212787 0.241667 0.256318 0.298497 0.241107 0.219406 0.260164
chargesum: 0.00000
title: Mulliken charges with hydrogens summed into heavy atoms:
elementType: Cl O O O C C C C C C C C C C
charge: -0.055734 -0.284599 -0.256312 -0.232457 0.132073 0.138294 0.221584 0.148365 -0.040046 -0.062874 0.010865 0.359091 -0.168279 0.090029
polarizability: 1.51944439e+02 1.41782409e+00 1.23205316e+02 -2.23882706e+00 3.73579105e+00 1.14424581e+02
1716.lowfreq: -15.9531 -9.0824 -2.3365 0.0010 0.0011 0.0017 10.2827 19.2840 25.8243
frequency: -3.4903 19.2447 25.6627 46.4726 81.3896 90.7014 101.6114 132.5668 154.9680 177.7882 194.4556 200.3267 207.9266 234.0385 238.3404 256.2268 275.5952 300.7591 334.9498 353.2422 411.5375 426.2574 440.3866 456.2489 568.6357 600.1670 670.4489 718.8171 775.4651 822.6518 854.5550 892.1724 907.6790 919.1246 928.2604 934.4545 958.3839 971.8417 991.4420 1036.3545 1064.2392 1072.4992 1104.3536 1108.1580 1135.8403 1139.1260 1153.7309 1162.9218 1188.7994 1220.6889 1227.0257 1234.2428 1293.7494 1316.0877 1329.4420 1339.5371 1340.9533 1348.3595 1376.1112 1381.4328 1390.8121 1398.3945 1408.9684 1456.9160 1460.5368 1464.7967 1465.3581 1467.4916 1468.7861 1471.3973 1480.6905 1482.3730 1490.1810 1633.1525 2902.1024 2918.8323 2952.4892 2969.7331 2973.7853 2978.8420 2992.1215 2993.8797 3001.4275 3023.5223 3059.9643 3067.5372 3076.0201 3089.0805 3094.1737 3095.1091 3106.5685 3125.1600 3128.8555
redmass: 2.6112 5.7502 3.9573 6.1531 4.2745 3.2788 3.9061 2.8421 3.0749 6.5434 1.2093 1.6957 1.2666 1.1746 1.1022 3.1567 3.3010 3.3970 2.6576 2.7051 2.9163 2.4942 3.2659 3.3198 4.9310 4.1010 3.5916 6.5622 3.7861 2.7190 3.6921 2.7042 1.8274 1.2505 1.5958 1.5920 1.5369 1.7845 1.5537 3.5906 1.7070 1.7713 3.4248 2.2309 2.1096 2.1507 1.7723 2.0279 1.7614 1.2403 1.1629 1.2191 1.3382 1.3487 1.6671 1.4128 1.6896 1.3484 1.2144 1.2564 1.2449 1.2257 1.3781 1.0742 1.0411 1.0535 1.0545 1.0484 1.0573 1.0580 1.0506 1.0678 1.0614 9.9855 1.0547 1.0589 1.1033 1.0359 1.0383 1.1003 1.0862 1.0390 1.0369 1.0851 1.0991 1.0987 1.0987 1.0942 1.0992 1.0977 1.0908 1.1015 1.0994
irintensity: 0.5281 0.5065 0.9731 1.9975 0.3348 1.9316 0.8200 5.8219 3.9639 4.6640 0.1128 1.0772 1.6881 0.0661 1.7585 2.1897 5.5554 1.5793 3.2409 0.8495 10.1343 5.0741 0.5897 1.9496 20.3726 16.9052 2.8304 2.8717 14.1688 0.7863 6.9564 24.2229 7.9460 2.2613 9.4081 1.7001 1.7225 6.8150 23.1934 196.2451 111.8198 52.6508 124.9938 16.3144 135.2771 21.4359 8.2961 34.4130 6.7180 30.4249 1.5815 8.3681 2.5908 48.6854 0.7740 5.1605 10.5001 10.8332 20.9513 22.2838 27.5511 25.7469 1.7863 17.2868 13.8867 9.2304 10.1938 1.1019 7.1054 7.2503 12.0750 9.9611 21.3646 173.6606 48.2506 85.9138 46.4580 38.4943 23.1409 42.0673 31.1372 11.0118 16.8838 17.5499 20.6868 66.4797 54.8470 11.8530 29.7111 24.2772 5.8321 10.9884 11.2109
temp: 298.150 k
press: 1.00000 atm
elementType: 17 8 8 8 6 6 6 6 6 6 6 6 6 6 1 1 1 1 1 1 1 1 1 1 1 1 1 1 1 1 1 1 1
symmnumber: 1
zpe: 725759.5 jmol-1
zpe.correction: 0.276427 hartree
zpe.thermalcorrener: 0.293545 hartree
zpe.thermalcorrenthalpy: 0.294489 hartree
zpe.thermalcorrgfe: 0.229542 hartree
zpe.sumelectzpe: -1077.037781 hartree
zpe.sumelectthermal: -1077.020663 hartree
zpe.sumelectthermalent: -1077.019719 hartree
zpe.sumelectthermalfe: -1077.084666 hartree
dipole: 2.7246 0.2924 0.5374
dipole: 2.7925
quadrupole: -94.2110 -94.5758 -88.9012
quadrupole: 3.5860 -10.3631 -3.5283
quadrupole: -1.6483 -2.0131 3.6614 3.5860 -10.3631 -3.5283
hfenergy: -1077.3142082 hartree
pointgroup: C01 [X(C10H19Cl1O3)]
dipole: -1.0533673 0.1061704 -0.2935165 debye
polarizability: 150.9116719|-6.3732664|117.9841834|-0.1491171|-5.58691|120.6784809 unknown
InChI: InChI=1S/C10H19ClO3/c1-7(2)5-13-6-8(3)14-10(12)9(4)11/h7-9H,5-6H2,1-4H3
charge 0 multiplicity 1
33 atoms
Cl 3.121674 -1.413486 2.133279
O  -1.919782 0.672522 -0.214097
O  0.990523 0.027307 -0.085421
O  3.143772 0.824893 -0.531495
C  -4.165463 -0.273514 -0.151024
C  -3.167226 0.654914 0.56064
C  0.40512 1.383682 -0.403278
C  -0.882846 1.485766 0.411855
C  -3.642049 -1.726863 -0.188061
C  -5.547913 -0.182714 0.537325
C  0.214153 1.511208 -1.918444
C  2.369904 -0.090181 -0.168461
C  2.798834 -1.497218 0.244547
C  4.064846 -1.973129 -0.455207
H  -4.26187 0.092516 -1.193341
H  -3.578087 1.688075 0.634609
H  -2.966334 0.285829 1.593352
H  1.130895 2.135718 -0.038053
H  -0.689766 1.145428 1.452288
H  -1.19806 2.554398 0.445421
H  -4.320313 -2.376166 -0.771781
H  -3.573114 -2.142304 0.836492
H  -2.637623 -1.765904 -0.642852
H  -6.278597 -0.837151 0.028618
H  -5.947396 0.849026 0.520809
H  -5.486255 -0.508624 1.593752
H  -0.241468 2.489864 -2.155719
H  1.186633 1.44794 -2.434085
H  -0.460724 0.721969 -2.284224
H  1.952617 -2.193707 0.163148
H  4.3891 -2.945815 -0.051416
H  3.86868 -2.089655 -1.538432
H  4.874333 -1.235922 -0.332244
