program: Gaussian 09
title: 000107019
version: EM64L-G09RevD.01
frameworkgroup: C1[X(C11H20O)]
method: RPBEPBE
basis: SDD
operation: Freq
keyword: #pfreq=noraman
keyword: PBEPBE/SDD
title: #p freq=noraman PBEPBE/SDD
converged: YES YES NO NO
title: Mulliken charges:
elementType: O C C C C C C C C C C C H H H H H H H H H H H H H H H H H H H H
charge: -0.437428 -0.194779 -0.121476 -0.021465 -0.511161 -0.537681 -0.475664 -0.462281 -0.514435 -0.065050 -0.362954 -0.715602 0.231031 0.228833 0.221766 0.220782 0.222119 0.202085 0.227104 0.218507 0.212827 0.202881 0.225628 0.203262 0.204065 0.207452 0.203052 0.210103 0.203952 0.208573 0.239026 0.326928
chargesum: 0.00000
title: Mulliken charges with hydrogens summed into heavy atoms:
elementType: O C C C C C C C C C C C
charge: -0.110500 0.036251 0.107358 0.200301 -0.068260 -0.108492 -0.044331 -0.033772 -0.107108 0.142402 0.050201 -0.064051
polarizability: 1.30987210e+02 1.66708388e+00 1.06000617e+02 -6.72228401e-01 2.54579503e-01 1.06953786e+02
1716.lowfreq: -22.8009 -16.2998 -0.0001 0.0006 0.0007 15.3203 28.5075 55.3354 80.1912
frequency: 25.1007 54.8543 80.1182 130.5870 140.9254 204.1839 239.5195 284.6520 300.3696 308.2487 312.3753 377.7821 419.4089 435.5229 501.8589 515.6695 558.0803 713.8605 750.2481 783.8786 801.7497 816.5183 834.6725 876.1546 886.1877 903.9888 920.8609 930.6407 945.1326 952.7905 957.1353 971.4004 976.5206 1009.4319 1030.5551 1046.0490 1077.1145 1082.7692 1095.7687 1114.3660 1119.5621 1140.2636 1145.0470 1172.3753 1174.6496 1211.3003 1232.2072 1243.1637 1243.4192 1259.4426 1271.9106 1279.3791 1292.2517 1298.1708 1302.2611 1309.8756 1319.9228 1335.5787 1347.6726 1357.2899 1370.2864 1386.6870 1457.2678 1464.5649 1467.5284 1467.9961 1472.2530 1480.6523 1484.1591 1496.9640 2939.1640 2954.7984 2961.5684 2970.7093 2972.9787 2987.7002 2992.1891 2998.7581 3007.3107 3009.8860 3042.9365 3045.0162 3047.6573 3059.3032 3062.0178 3065.8883 3067.2469 3072.7239 3085.3905 3556.2343
redmass: 3.2407 3.1045 2.8518 2.6294 3.1990 1.0539 2.7453 1.8195 1.6960 2.0740 2.5225 1.9174 1.8541 1.8258 3.1608 2.4960 3.6690 3.0091 3.3068 2.7130 1.4494 2.3035 2.3381 2.0194 2.0927 1.3252 2.4678 2.2108 1.8510 1.6113 1.9275 1.7057 2.9791 2.3169 1.4743 1.6932 1.4412 2.1894 1.3124 1.0881 1.2362 1.7047 1.5701 1.7644 1.8566 1.4605 1.4231 1.5013 1.4411 1.3532 1.3231 1.4133 1.4711 1.4008 1.4731 1.3031 1.4834 1.4421 1.3533 1.4706 1.2422 1.2162 1.0809 1.0702 1.0905 1.0878 1.0611 1.0729 1.0660 1.0947 1.0805 1.0620 1.0739 1.0674 1.0430 1.0612 1.0593 1.0593 1.0669 1.0955 1.0930 1.1005 1.1000 1.0991 1.0939 1.0984 1.1037 1.1046 1.0990 1.0660
irintensity: 0.5303 0.7724 2.1375 1.1886 2.1918 0.2233 1.8639 30.8735 33.8700 13.6181 54.9168 2.0271 17.1853 1.1986 1.5175 4.7697 0.5612 1.5890 1.2466 3.0558 3.2827 4.0265 5.4598 6.2580 3.1139 16.4156 0.3832 3.8686 3.3492 3.4683 3.2862 2.4635 103.7718 0.1969 4.3521 1.2529 8.2895 4.8684 4.2765 0.4077 1.5138 4.1937 3.1061 4.6993 0.8184 3.6469 4.4838 0.6832 0.3961 0.6861 1.3746 5.0776 0.0413 0.1431 1.4364 12.0220 1.1477 4.2376 11.9482 2.0709 12.4076 16.0179 2.8352 3.1521 7.1606 17.1696 15.7141 3.8352 6.1904 9.4455 11.5790 32.1221 38.8555 67.9059 9.5525 53.7300 30.5725 43.5516 26.8484 85.1686 68.9499 45.3823 13.7468 10.1098 19.3893 74.5537 54.2650 94.3318 25.5328 6.6017
temp: 298.150 k
press: 1.00000 atm
elementType: 8 6 6 6 6 6 6 6 6 6 6 6 1 1 1 1 1 1 1 1 1 1 1 1 1 1 1 1 1 1 1 1
symmnumber: 1
zpe: 758854.9 jmol-1
zpe.correction: 0.289033 hartree
zpe.thermalcorrener: 0.301468 hartree
zpe.thermalcorrenthalpy: 0.302412 hartree
zpe.thermalcorrgfe: 0.249753 hartree
zpe.sumelectzpe: -505.396219 hartree
zpe.sumelectthermal: -505.383783 hartree
zpe.sumelectthermalent: -505.382839 hartree
zpe.sumelectthermalfe: -505.435498 hartree
dipole: -2.1377 0.1872 -0.5834
dipole: 2.2238
quadrupole: -89.6732 -76.4912 -72.0607
quadrupole: 2.9546 -1.4352 1.2239
quadrupole: -10.2648 2.9172 7.3476 2.9546 -1.4352 1.2239
hfenergy: -505.6852511 hartree
pointgroup: C01 [X(C11H20O1)]
dipole: 0.8425914 -0.0733354 -0.2238491 debye
polarizability: 130.9801838|1.6332714|105.9995144|0.8567|-0.2492252|106.961915 unknown
InChI: InChI=1S/C11H20O/c1-8(7-12)4-11-6-9-2-3-10(11)5-9/h8-12H,2-7H2,1H3
charge 0 multiplicity 1
32 atoms
O  -3.921718 1.15958 -0.538429
C  0.975164 0.632881 -0.75932
C  2.824314 0.18075 0.502002
C  0.367807 0.362027 0.660026
C  2.300377 1.356252 -0.375623
C  1.647331 -0.013742 1.505441
C  1.520081 -0.687919 -1.384132
C  2.798053 -0.998852 -0.516024
C  -0.759144 -0.692576 0.752128
C  -2.018092 -0.436043 -0.122055
C  -2.766288 0.841488 0.322677
C  -2.965451 -1.6569 -0.088094
H  0.302515 1.194752 -1.430099
H  3.804647 0.331685 0.984196
H  -0.024791 1.329641 1.034378
H  2.137413 2.288596 0.195759
H  2.94779 1.573341 -1.24488
H  1.601193 -1.055575 1.876245
H  1.756624 0.646343 2.385682
H  1.788773 -0.525785 -2.444269
H  0.779956 -1.506909 -1.359344
H  2.73728 -1.977448 -0.005763
H  3.71178 -1.004386 -1.138683
H  -1.076747 -0.778966 1.81366
H  -0.35036 -1.687691 0.482944
H  -1.682349 -0.282408 -1.171966
H  -2.076415 1.709655 0.366716
H  -3.209137 0.694733 1.323923
H  -3.227324 -1.914409 0.95669
H  -2.490004 -2.544433 -0.54563
H  -3.904508 -1.441962 -0.627695
H  -3.591868 1.312882 -1.46016
