program: Gaussian 09
title: 000106978
version: EM64L-G09RevD.01
frameworkgroup: C1[X(C11H10N2O6S)]
method: RPBEPBE
basis: SDD
operation: Freq
keyword: #p
keyword: freq=noraman
keyword: PBEPBE/SDD
title: #p freq=noraman PBEPBE/SDD
converged: YES YES NO NO
title: Mulliken charges:
elementType: S O O O O O O N N C C C C C C C C C C C H H H H H H H H H H
charge: 0.991241 -0.177335 -0.566872 -0.499331 -0.501287 -0.427732 -0.206963 -0.326924 0.019698 0.358123 0.352724 -0.614272 0.181582 -0.073334 -0.316558 -0.369882 0.107598 -0.255763 -0.780478 0.130988 0.300319 0.301164 0.284219 0.287725 0.287715 0.230461 0.226144 0.277798 0.383715 0.395519
chargesum: 0.00000
title: Mulliken charges with hydrogens summed into heavy atoms:
elementType: S O O O O O O N N C C C C C C C C C C C
charge: 0.991241 -0.177335 -0.183157 -0.499331 -0.501287 -0.032213 -0.206963 -0.326924 0.019698 0.358123 0.352724 -0.012789 0.181582 -0.073334 -0.032340 -0.082157 0.107598 0.031953 -0.046076 0.130988
polarizability: 3.07645295e+02 -8.61006778e+00 1.76160321e+02 8.02281696e-01 5.14838580e+00 1.06715260e+02
1716.lowfreq: -5.2444 -0.0009 0.0011 0.0014 2.1489 5.4161 24.8760 31.9750 43.7800
frequency: 24.7344 31.9582 43.7745 51.6822 73.7150 101.6841 119.2717 128.6836 146.2336 169.5095 178.0307 183.0972 207.8672 216.9121 251.1242 262.9729 293.9908 303.0570 329.6655 339.1046 376.9119 396.1824 426.4469 438.3057 451.8551 458.4530 493.5337 534.4011 545.2668 566.6116 590.6046 602.6046 603.9335 617.0886 670.2952 696.9510 728.3431 746.3255 817.0602 831.0123 844.0442 882.6373 902.3428 925.6229 938.3101 964.1984 968.7872 1002.8484 1008.9246 1047.9746 1049.5301 1064.3997 1085.0631 1103.8985 1111.0587 1141.2100 1152.1579 1209.6810 1255.6302 1277.3652 1299.8412 1367.0791 1382.6785 1397.9085 1404.1241 1407.2563 1461.1767 1473.5997 1481.6539 1505.9905 1576.7815 1605.8747 1657.3423 1673.4776 2998.2406 3029.3406 3080.2014 3084.3249 3102.0704 3154.6212 3169.1040 3194.5563 3481.3680 3530.0975
redmass: 9.7345 6.5658 5.2872 8.5868 8.7869 8.6266 5.3467 4.7653 5.0245 1.7381 4.7275 1.1888 4.7342 3.3068 4.9784 3.0577 5.4233 6.8803 10.0356 7.8292 7.8556 7.3103 8.2318 2.6568 3.3069 4.3070 5.3841 6.6568 5.7747 5.4783 1.8985 2.9476 2.4877 5.4299 6.9181 5.6014 4.1706 5.8708 6.4071 1.5085 8.5430 7.5624 1.3477 2.6921 5.2916 1.6703 5.3014 1.6411 4.4193 1.5394 1.1698 5.4178 2.1349 1.2080 4.9185 1.7861 1.5227 2.3230 1.8593 1.3102 3.9254 4.8389 6.0578 1.1997 3.4300 1.2460 1.1055 1.1677 2.3205 8.0254 6.4438 7.5005 9.4637 12.4524 1.0370 1.0628 1.0989 1.0968 1.1006 1.0925 1.0910 1.0959 1.0661 1.0644
irintensity: 1.1479 0.6511 1.2304 1.7809 0.7400 0.6363 1.6710 3.9306 9.7163 38.6932 7.4677 2.8181 8.0156 4.8517 17.7912 37.6536 19.4100 31.0383 11.5483 28.8759 0.4516 2.5122 21.3197 10.4583 8.0958 27.4294 10.8329 88.9522 16.0304 102.5031 39.5301 16.2472 82.9887 84.3342 16.2651 46.9561 2.9356 15.8289 28.5936 23.2733 79.0486 33.2792 11.6345 5.1062 24.0635 13.6218 73.5888 19.9524 446.1814 6.8301 77.7036 151.5660 63.0582 1.2082 1.5180 139.1533 66.2532 1.9335 28.0064 1.2695 230.9176 21.3574 7.7489 25.3540 24.5584 12.1030 21.1839 18.9840 94.8066 179.4376 14.8766 10.6503 366.4144 131.4638 11.6354 4.9335 0.4553 12.3627 16.6856 2.8985 3.1622 1.1281 45.8661 79.2013
temp: 298.150 k
press: 1.00000 atm
elementType: 16 8 8 8 8 8 8 7 7 6 6 6 6 6 6 6 6 6 6 6 1 1 1 1 1 1 1 1 1 1
symmnumber: 1
zpe: 529369.4 jmol-1
zpe.correction: 0.201626 hartree
zpe.thermalcorrener: 0.221375 hartree
zpe.thermalcorrenthalpy: 0.222320 hartree
zpe.thermalcorrgfe: 0.151871 hartree
zpe.sumelectzpe: -1382.431972 hartree
zpe.sumelectthermal: -1382.412223 hartree
zpe.sumelectthermalent: -1382.411279 hartree
zpe.sumelectthermalfe: -1382.481728 hartree
dipole: 6.3136 0.0258 0.8893
dipole: 6.3760
quadrupole: -114.8615 -134.8635 -122.9399
quadrupole: 10.0721 -11.2870 6.4788
quadrupole: 9.3601 -10.6419 1.2817 10.0721 -11.2870 6.4788
hfenergy: -1382.6335981 hartree
pointgroup: C01 [X(C11H10N2O6S1)]
dipole: -2.485303 0.0357623 -0.338475 debye
polarizability: 307.6368635|8.6483826|176.5535977|0.7245942|0.4413458|106.3304142 unknown
InChI: InChI=1S/C11H10N2O6S/c1-6-4-7(20(17,18)19)2-3-9(6)13-10(14)5-8(12-13)11(15)16/h2-4,15,17H,5H2,1H3
charge 0 multiplicity 1
30 atoms
S  4.676656 -0.126343 -0.128333
O  -1.532626 2.787554 0.817403
O  4.747279 -0.730227 -1.885265
O  5.387642 1.324635 -0.054503
O  5.15035 -1.327668 0.846899
O  -5.802559 -0.209458 -0.412133
O  -4.576561 -2.137705 -0.910173
N  -1.351808 0.509804 0.079067
N  -2.219035 -0.527842 -0.310903
C  0.068429 0.315342 0.04257
C  0.649933 -0.931161 0.434669
C  -3.534336 1.356296 0.272298
C  -2.056349 1.716253 0.44524
C  2.817064 0.060093 -0.073133
C  0.865476 1.414291 -0.369327
C  2.060097 -1.03912 0.352324
C  -3.464226 -0.06946 -0.207071
C  2.265931 1.297416 -0.432225
C  -0.149209 -2.112772 0.946436
C  -4.606162 -0.941398 -0.551921
H  -4.029353 2.030187 -0.448817
H  -4.081363 1.465371 1.225466
H  0.389222 2.35949 -0.636871
H  2.558825 -1.967628 0.648529
H  2.899201 2.134127 -0.739911
H  0.518977 -2.845849 1.427663
H  -0.90917 -1.801569 1.685028
H  -0.695424 -2.613878 0.129716
H  5.709925 -0.891943 -2.109874
H  -6.573026 -0.79524 -0.642748
