program: Gaussian 09
title: 000008552
version: EM64L-G09RevD.01
frameworkgroup: C1[X(C14H8O5S)]
method: RPBEPBE
basis: SDD
operation: Freq
keyword: #p
keyword: freq=noraman
keyword: PBEPBE/SDD
title: #p freq=noraman PBEPBE/SDD
converged: YES YES NO NO
title: Mulliken charges:
elementType: S O O O O O C C C C C C C C C C C C C C H H H H H H H H
charge: 0.990164 -0.177704 -0.180358 -0.564951 -0.488133 -0.493846 0.262262 0.282141 0.277681 0.268656 -0.202778 -0.201363 -0.343416 -0.067922 -0.353764 -0.234456 -0.362979 -0.362145 -0.222871 -0.221650 0.330112 0.303881 0.296770 0.293730 0.292628 0.246417 0.246107 0.387788
chargesum: 0.00000
title: Mulliken charges with hydrogens summed into heavy atoms:
elementType: S O O O O O C C C C C C C C C C C C C C
charge: 0.990164 -0.177704 -0.180358 -0.177163 -0.488133 -0.493846 0.262262 0.282141 0.277681 0.268656 -0.202778 -0.201363 -0.013304 -0.067922 -0.049883 0.062314 -0.069249 -0.069517 0.023546 0.024457
polarizability: 3.14234016e+02 5.98175200e+00 2.06178998e+02 -1.71904698e+00 4.02998679e-01 8.95423037e+01
1716.lowfreq: -1.9726 -0.0020 -0.0009 -0.0008 4.2796 10.3011 26.7023 37.5548 71.6515
frequency: 26.6808 37.5132 71.6491 89.9637 118.2840 133.3888 155.6747 168.7779 184.4113 203.0039 209.4566 266.9534 282.6410 294.4188 337.2638 362.2153 370.5451 384.0292 405.8819 412.1861 438.7952 448.8217 454.1687 482.8519 523.6181 567.0534 622.2610 628.7637 661.8588 673.2610 682.3331 723.8071 735.5528 787.4526 807.9952 837.0382 856.3589 890.6259 911.0922 932.1362 937.8793 968.6004 971.3681 1000.8046 1010.8172 1019.0193 1034.0101 1048.1818 1061.1514 1084.5303 1100.3621 1159.3538 1166.1523 1178.4566 1219.6235 1250.8228 1287.8802 1301.0378 1389.5048 1400.7491 1408.9220 1442.6650 1452.8781 1470.4163 1541.0922 1550.4685 1568.6618 1592.5837 1602.1235 1615.7967 3141.5999 3154.8710 3157.7663 3158.9439 3164.9210 3174.1945 3175.0693 3480.1679
redmass: 8.6862 7.9499 7.9560 9.1102 4.3583 5.6912 7.3197 2.3263 10.4237 2.5361 6.2240 4.8523 7.1103 5.1665 8.6709 8.7549 10.6359 9.5173 3.4107 7.8872 4.4711 3.6310 10.1662 9.4633 6.4662 8.8954 7.0750 7.0699 4.0711 6.8666 7.3050 2.8029 3.3916 7.0501 1.6868 12.8970 1.8270 1.6428 6.8826 5.7604 1.7344 2.4632 4.9375 1.3940 1.3936 1.3833 2.0809 1.2606 1.7414 3.1357 2.2190 1.6131 1.9376 1.3409 1.5798 1.4882 2.2774 3.7647 7.7664 5.4037 7.5405 2.6311 2.6847 2.6700 10.6728 9.1945 7.6902 7.0117 8.3544 7.6460 1.0866 1.0902 1.0923 1.0896 1.0949 1.0978 1.1002 1.0662
irintensity: 1.5300 1.6523 5.9663 0.1649 0.6270 1.9216 4.1152 37.3942 3.5259 24.7972 1.9025 21.7750 8.6527 43.8508 9.1097 33.2707 35.6426 20.4069 1.6184 22.9365 0.7617 0.1324 9.9298 7.3262 54.4199 126.0613 3.7978 11.9306 14.4347 0.4463 6.9503 60.3191 15.1808 5.4860 19.6976 80.4864 10.2475 23.7450 20.4800 47.1449 9.7149 34.8394 60.2621 4.1466 1.9005 0.0075 0.2003 49.1193 64.9836 1.0557 1.0786 16.7725 1.7228 6.6810 0.5179 24.9798 147.5183 508.8373 2.2117 4.5102 5.2898 0.7725 5.8312 7.9895 1.7681 258.5651 7.3492 1.9329 1.1431 4.7302 3.1455 2.8327 10.0275 8.5697 0.6245 2.6829 24.4840 54.1564
temp: 298.150 k
press: 1.00000 atm
elementType: 16 8 8 8 8 8 6 6 6 6 6 6 6 6 6 6 6 6 6 6 1 1 1 1 1 1 1 1
symmnumber: 1
zpe: 488221.3 jmol-1
zpe.correction: 0.185954 hartree
zpe.thermalcorrener: 0.202990 hartree
zpe.thermalcorrenthalpy: 0.203934 hartree
zpe.thermalcorrgfe: 0.140351 hartree
zpe.sumelectzpe: -1310.928421 hartree
zpe.sumelectthermal: -1310.911385 hartree
zpe.sumelectthermalent: -1310.910441 hartree
zpe.sumelectthermalfe: -1310.974024 hartree
dipole: -4.9047 0.6041 1.4863
dipole: 5.1605
quadrupole: -105.5498 -130.8766 -125.1569
quadrupole: 7.1490 10.7522 -2.6882
quadrupole: 14.9780 -10.3488 -4.6292 7.1490 10.7522 -2.6882
hfenergy: -1311.114375 hartree
pointgroup: C01 [X(C14H8O5S1)]
dipole: -1.9275405 -0.2928733 -0.5664491 debye
polarizability: 314.5000476|-2.8732069|205.9251224|-0.4314266|0.4753198|89.5301481 unknown
InChI: InChI=1S/C14H8O5S/c15-13-9-3-1-2-4-10(9)14(16)12-7-8(20(17,18)19)5-6-11(12)13/h1-7,17H
charge 0 multiplicity 1
28 atoms
S  4.32108 0.458861 0.07864
O  -0.682938 2.585775 0.037363
O  -1.710564 -2.836859 -0.014104
O  4.475609 0.617286 -1.76357
O  4.402819 1.931565 0.738421
O  5.286608 -0.734527 0.589062
C  0.184634 0.336465 0.025398
C  -0.076663 -1.064108 0.009653
C  -2.327464 0.815052 0.013717
C  -2.592931 -0.587568 0.000347
C  -0.930104 1.340655 0.026341
C  -1.484475 -1.586829 -0.002516
C  1.520741 0.806497 0.035851
C  2.541395 -0.146519 0.034843
C  0.995559 -1.990397 0.012335
C  2.328779 -1.53741 0.022171
C  -3.406007 1.733616 0.015411
C  -3.933005 -1.047915 -0.011129
C  -4.73538 1.266497 0.004035
C  -4.999488 -0.127102 -0.009194
H  1.716197 1.883741 0.057172
H  0.75915 -3.058545 0.003361
H  3.17706 -2.228596 0.033928
H  -3.175139 2.803366 0.025868
H  -4.109117 -2.128073 -0.021402
H  -5.565877 1.980004 0.005565
H  -6.033424 -0.487306 -0.017939
H  5.380946 0.995977 -1.964329
