program: Gaussian 09
title: 000106806
version: EM64L-G09RevD.01
frameworkgroup: C1[X(C13H22O)]
method: RPBEPBE
basis: SDD
operation: Freq
keyword: #pfreq=noraman
keyword: PBEPBE/SDD
title: #p freq=noraman PBEPBE/SDD
converged: YES YES NO NO
title: Mulliken charges:
elementType: O C C C C C C C C C C C C C H H H H H H H H H H H H H H H H H H H H H H
charge: -0.451967 0.201621 -0.222431 -0.497161 0.431290 -0.417384 -0.775854 -0.779517 -0.165188 -0.850550 -0.221250 -0.468011 -0.012679 -0.710580 0.221093 0.217604 0.213072 0.232349 0.209230 0.212583 0.240568 0.206228 0.252185 0.220162 0.233003 0.228193 0.224766 0.230956 0.214429 0.221244 0.189031 0.185880 0.232729 0.206999 0.213079 0.334282
chargesum: 0.00000
title: Mulliken charges with hydrogens summed into heavy atoms:
elementType: O C C C C C C C C C C C C C
charge: -0.117685 0.201621 -0.001338 -0.066485 0.431290 -0.185036 -0.113473 -0.100942 0.067814 -0.166635 -0.006821 -0.057735 0.173200 -0.057774
polarizability: 1.82329374e+02 1.46086541e+00 1.39164144e+02 -6.49568202e+00 1.73146586e+00 1.12112452e+02
1716.lowfreq: -16.7636 -9.8971 -3.0778 -0.0007 -0.0004 0.0001 17.8593 32.6246 46.4201
frequency: 17.0938 32.5356 46.3664 70.1632 88.3070 160.1748 180.9927 205.9214 219.8214 228.0973 237.8822 248.2463 260.2217 268.3356 271.9904 277.3692 303.7377 319.1696 349.6868 389.2544 428.0522 465.2500 498.5837 514.2904 568.7838 575.7559 643.8879 697.6722 779.6560 795.3282 813.3313 837.2575 894.8369 911.0969 915.8982 935.2008 947.6207 972.0805 977.2734 998.5440 1015.5069 1021.8166 1039.8956 1045.0786 1061.2003 1075.4116 1106.4051 1110.1608 1115.3836 1144.3647 1153.8350 1196.6222 1204.5292 1225.9929 1242.4390 1252.1780 1268.7875 1288.3629 1290.1219 1297.4128 1310.4378 1322.9439 1347.0179 1368.1497 1372.5150 1386.2003 1386.6591 1397.0976 1440.9257 1457.3289 1464.2792 1466.3947 1467.6858 1468.4623 1472.4459 1474.8350 1483.1576 1484.2609 1667.2043 1687.0736 2930.5509 2949.7415 2961.2721 2963.9702 2968.6249 2968.8714 2971.7049 2973.4109 3025.6560 3032.3070 3038.8563 3058.4989 3061.9498 3062.8206 3063.0515 3064.2726 3071.9436 3074.4839 3077.3298 3083.7659 3136.9342 3554.4039
redmass: 3.8078 3.9577 3.1161 3.6476 2.8797 1.5936 1.4461 1.9250 1.2687 1.5174 1.6662 1.7886 1.2789 1.7826 1.3773 1.8749 2.3772 2.8022 2.4806 2.8975 2.2279 2.4875 3.1093 2.6718 3.1984 3.1269 3.7002 2.9647 2.2945 1.8866 1.3774 2.1123 1.7862 2.0226 1.8291 1.5298 1.7018 1.5644 1.1794 1.5049 1.5673 1.6850 2.4183 1.6026 2.2214 2.0659 1.5458 2.2473 2.1860 2.5127 1.4107 1.6768 2.8287 2.1097 1.3483 1.1778 1.3552 1.4132 1.4451 1.2742 2.2590 1.3068 1.5346 1.2061 1.5999 1.2365 1.2207 1.2367 1.0989 1.0492 1.0508 1.0835 1.0641 1.0532 1.0634 1.0539 1.0620 1.0528 6.9968 6.7517 1.0839 1.0677 1.0371 1.0350 1.0479 1.0575 1.0674 1.0413 1.0946 1.0962 1.0960 1.0994 1.0956 1.0994 1.0983 1.0978 1.1002 1.0981 1.0883 1.0994 1.0955 1.0660
irintensity: 1.0690 1.1604 1.1327 0.4883 1.5157 2.7435 1.3257 1.2384 0.1771 0.3247 0.4168 0.8115 6.6323 9.3101 90.2786 39.8854 3.6503 3.4244 0.1090 9.9364 4.6454 3.2940 4.6579 1.9724 0.3016 4.3151 2.2776 1.6171 3.5208 10.8938 27.3989 17.9184 7.2565 5.0340 3.5458 0.3939 3.0701 7.7290 39.5214 1.5613 18.9596 10.1366 2.7784 6.8635 10.3006 56.7874 6.6459 3.2651 3.9111 12.7918 7.6887 2.4507 7.1217 2.6082 12.4436 13.0510 1.5743 2.9072 3.6689 0.9931 1.8589 6.0951 3.5075 20.5869 16.4706 9.5921 18.0862 15.6337 9.1609 12.8129 1.0881 5.9842 8.4321 11.7079 9.1190 9.4586 6.7523 13.6222 5.2436 1.0502 54.9023 39.5076 28.5913 35.1224 36.8115 24.9804 20.0082 53.5841 39.0166 24.1420 7.3897 2.7281 33.6120 8.6187 39.8738 68.3337 24.1196 35.3686 43.5850 49.7778 33.3034 4.7749
temp: 298.150 k
press: 1.00000 atm
elementType: 8 6 6 6 6 6 6 6 6 6 6 6 6 6 1 1 1 1 1 1 1 1 1 1 1 1 1 1 1 1 1 1 1 1 1 1
symmnumber: 1
zpe: 828538.2 jmol-1
zpe.correction: 0.315574 hartree
zpe.thermalcorrener: 0.332526 hartree
zpe.thermalcorrenthalpy: 0.333470 hartree
zpe.thermalcorrgfe: 0.270383 hartree
zpe.sumelectzpe: -582.648346 hartree
zpe.sumelectthermal: -582.631393 hartree
zpe.sumelectthermalent: -582.630449 hartree
zpe.sumelectthermalfe: -582.693536 hartree
dipole: 1.8996 -0.6517 -0.8804
dipole: 2.1928
quadrupole: -74.9266 -84.8930 -87.9396
quadrupole: -1.8135 -3.4958 1.1909
quadrupole: 7.6598 -2.3066 -5.3532 -1.8135 -3.4958 1.1909
hfenergy: -582.9639193 hartree
pointgroup: C01 [X(C13H22O1)]
dipole: -0.7504912 0.2667514 -0.3314723 debye
polarizability: 182.559041|0.9330209|139.1631505|5.2616921|-1.6179896|111.8837789 unknown
InChI: InChI=1S/C13H22O/c1-10-8-9-12(13(10,3)4)7-5-6-11(2)14/h5,7-8,11-12,14H,6,9H2,1-4H3
charge 0 multiplicity 1
36 atoms
O  -3.149274 1.423073 0.577198
C  1.652105 0.538141 -0.02546
C  0.90715 -0.837132 -0.306262
C  1.898931 -1.932272 0.20194
C  3.132364 0.101365 -0.070989
C  3.25064 -1.247133 0.071045
C  1.275069 1.588679 -1.096695
C  1.326802 1.111619 1.385783
C  -0.490537 -0.929433 0.251296
C  4.258481 1.099594 -0.178336
C  -1.627517 -0.907441 -0.49037
C  -3.031949 -0.933028 0.071558
C  -3.820118 0.365461 -0.211957
C  -5.305979 0.250773 0.176305
H  0.855131 -0.932075 -1.410779
H  1.816699 -2.864163 -0.388376
H  1.691104 -2.209121 1.257998
H  4.202872 -1.787166 0.128262
H  1.768141 2.560201 -0.902947
H  1.565429 1.251911 -2.109816
H  0.181523 1.756967 -1.086864
H  1.94281 2.007467 1.59127
H  0.263955 1.408806 1.450023
H  1.53313 0.371617 2.180983
H  -0.579861 -0.982085 1.347923
H  5.243953 0.602704 -0.145243
H  4.223149 1.839367 0.646025
H  4.198541 1.67613 -1.122022
H  -1.544387 -0.843951 -1.588424
H  -3.005635 -1.083832 1.167527
H  -3.606004 -1.774773 -0.368102
H  -3.740091 0.606849 -1.296407
H  -5.403863 0.016745 1.251876
H  -5.847909 1.196068 -0.020681
H  -5.805968 -0.547798 -0.402978
H  -3.638586 2.275365 0.448397
