program: Gaussian 09
title: 000008536
version: EM64L-G09RevD.01
frameworkgroup: C1[X(C11H10O5S)]
method: RPBEPBE
basis: SDD
operation: Freq
keyword: #p
keyword: freq=noraman
keyword: PBEPBE/SDD
title: #p freq=noraman PBEPBE/SDD
converged: NO YES NO NO
title: Mulliken charges:
elementType: S O O O O O C C C C C C C C C C C H H H H H H H H H H
charge: 1.059267 -0.540405 -0.218644 -0.498389 -0.491359 -0.169023 -0.236232 -0.540094 0.145361 -0.677605 0.213536 0.030758 0.198883 -0.340415 -0.350790 -0.219217 -0.215216 0.305342 0.290592 0.284153 0.261108 0.236691 0.288158 0.288280 0.395281 0.250041 0.249938
chargesum: 0.00000
title: Mulliken charges with hydrogens summed into heavy atoms:
elementType: S O O O O O C C C C C C C C C C C
charge: 1.059267 -0.145124 -0.218644 -0.498389 -0.491359 -0.169023 -0.236232 0.055840 0.145361 0.104348 0.213536 0.030758 0.198883 -0.052257 -0.062510 0.030824 0.034722
polarizability: 2.30050369e+02 -1.07209102e+00 1.67948111e+02 2.58398658e+00 -2.23443988e+00 1.01059212e+02
1716.lowfreq: -4.4679 0.0014 0.0018 0.0019 6.6633 9.9154 19.8653 42.7354 76.5681
frequency: 19.4985 42.6681 76.5635 115.6708 130.8623 164.3872 175.5670 184.6746 197.7584 208.3660 237.5540 254.5565 267.7006 297.8710 325.0410 338.6580 365.1265 397.9074 406.4229 423.2776 449.2205 462.2829 477.2523 543.3286 556.6075 588.7081 618.6691 667.7831 690.7436 718.7598 772.2964 775.7135 803.6602 848.4895 886.9808 919.1263 932.1254 956.4678 987.2395 999.5906 1014.6353 1019.8046 1044.6509 1060.3908 1081.6516 1107.6885 1115.3289 1176.4112 1194.8712 1220.4880 1238.5252 1266.4943 1289.6731 1303.4037 1390.9779 1399.9502 1430.2668 1439.0569 1455.7104 1462.1681 1467.3867 1553.3172 1575.1759 1593.2861 1619.5769 2987.8449 2989.8999 3084.1090 3101.6541 3113.2865 3144.3137 3155.8619 3165.8972 3176.7334 3414.7754
redmass: 8.3785 9.1255 4.7011 4.8504 6.7639 5.3464 6.6307 4.2218 2.6362 2.0062 2.7685 4.8817 5.9328 8.3371 4.0289 7.1133 3.5932 4.4836 4.9893 3.4356 1.7826 4.5699 4.9040 5.4581 8.2768 3.2791 4.7287 5.5837 4.4930 3.6946 2.5409 4.5295 1.7994 15.3968 2.9506 1.6493 2.0662 6.7105 1.9177 1.4025 3.9002 1.3766 1.9272 2.1472 2.2903 1.2718 1.7427 1.0790 3.4403 1.9225 2.2741 1.8511 2.0166 1.7864 1.1657 10.0889 1.1031 2.2987 1.0591 1.1142 2.3214 9.2260 7.3590 7.7816 8.7136 1.0368 1.0668 1.0975 1.0944 1.1009 1.0868 1.0901 1.0951 1.1007 1.0651
irintensity: 0.1917 2.9277 8.0733 0.7054 2.8775 0.9252 1.2789 6.5963 7.6660 2.6138 1.5127 1.9641 5.0627 7.6370 1.9394 28.5886 1.6753 6.8259 6.7498 51.8241 164.9291 10.6836 29.3628 6.7346 131.2178 13.6705 5.7916 0.3937 9.5236 21.6848 21.0955 8.2335 40.5772 105.0336 1.1377 1.8921 5.9271 73.6623 35.9546 4.5541 29.5454 0.3225 36.3121 8.0673 2.7083 112.8551 12.0238 11.9542 0.9333 45.7644 121.9922 207.5097 18.7275 53.2582 29.5012 1.3395 12.3593 1.3688 7.7316 27.3557 4.9216 82.9339 80.5449 55.1814 79.8576 5.0468 8.9203 4.1383 0.7869 1.3768 2.3720 1.4020 0.7949 21.4093 55.1339
temp: 298.150 k
press: 1.00000 atm
elementType: 16 8 8 8 8 8 6 6 6 6 6 6 6 6 6 6 6 1 1 1 1 1 1 1 1 1 1
symmnumber: 1
zpe: 497290.3 jmol-1
zpe.correction: 0.189408 hartree
zpe.thermalcorrener: 0.205706 hartree
zpe.thermalcorrenthalpy: 0.206650 hartree
zpe.thermalcorrgfe: 0.145215 hartree
zpe.sumelectzpe: -1197.949989 hartree
zpe.sumelectthermal: -1197.933692 hartree
zpe.sumelectthermalent: -1197.932747 hartree
zpe.sumelectthermalfe: -1197.994182 hartree
dipole: -8.3836 -1.9451 1.7039
dipole: 8.7733
quadrupole: -111.2686 -112.1553 -108.9551
quadrupole: 8.5514 4.8381 3.4803
quadrupole: -0.4756 -1.3623 1.8379 8.5514 4.8381 3.4803
hfenergy: -1198.1393974 hartree
pointgroup: C01 [X(C11H10O5S1)]
dipole: 3.3049551 -0.7215093 -0.6862383 debye
polarizability: 229.9527872|3.1457505|167.9144357|-0.9443736|-4.1057618|101.190469 unknown
InChI: InChI=1S/C11H10O5S/c1-11(17(14,15)16)6-9(12)7-4-2-3-5-8(7)10(11)13/h2-5,14H,6H2,1H3
charge 0 multiplicity 1
27 atoms
S  -3.022526 -0.117529 0.322356
O  -2.687876 -1.214822 1.773112
O  -0.734556 -2.099386 -0.013997
O  -3.922997 -0.890383 -0.773251
O  -3.553585 1.246427 0.997969
O  1.205474 3.037427 -0.199049
C  -1.140422 0.272555 -0.450161
C  -0.702371 1.576512 0.214308
C  -0.261052 -0.925955 -0.102435
C  -1.392857 0.35355 -1.962996
C  1.198378 -0.650243 0.026499
C  0.786108 1.861813 -0.027082
C  1.709931 0.684126 0.019771
C  2.094169 -1.747377 0.111397
C  3.10761 0.899381 0.087602
C  3.482125 -1.521485 0.186954
C  3.990009 -0.196613 0.171011
H  -0.848726 1.514989 1.312542
H  -1.299187 2.432348 -0.138215
H  -1.849986 -0.577554 -2.336358
H  -2.065375 1.19532 -2.200573
H  -0.434408 0.517896 -2.491195
H  1.679237 -2.760149 0.109083
H  3.474391 1.930806 0.08075
H  -2.330178 -2.068162 1.379279
H  4.171248 -2.36958 0.253352
H  5.070124 -0.026013 0.226525
