program: Gaussian 09
title: 000106717
version: EM64L-G09RevD.01
frameworkgroup: C1[X(C11H21ClNO3)]
method: RPBEPBE
basis: SDD
operation: Freq
keyword: #p
keyword: freq=noraman
keyword: PBEPBE/SDD
title: #p freq=noraman PBEPBE/SDD
converged: YES YES NO NO
title: Mulliken charges:
elementType: Cl O O O N C C C C C C C C C C C H H H H H H H H H H H H H H H H H H H H H
charge: -0.015426 -0.439659 -0.258718 -0.257711 -0.099346 -0.332699 -0.357836 -0.570521 -0.579865 -0.044573 -0.330748 -0.655473 0.159177 0.342535 -0.743599 -0.592038 0.264349 0.280745 0.339245 0.270131 0.267020 0.271395 0.276329 0.297742 0.245754 0.302363 0.260137 0.272603 0.221041 0.323086 0.281010 0.373005 0.248216 0.237884 0.235102 0.250598 0.258744
chargesum: 1.00000
title: Mulliken charges with hydrogens summed into heavy atoms:
elementType: Cl O O O N C C C C C C C C C C C
charge: -0.015426 -0.066654 -0.258718 -0.257711 -0.099346 0.212395 0.251540 0.244223 0.265995 0.215564 0.162896 -0.051377 0.159177 0.342535 -0.022397 -0.082696
polarizability: 1.67069639e+02 1.79917061e+01 1.30584908e+02 2.76675756e+00 -1.19958122e+01 1.33239312e+02
1716.lowfreq: -12.1854 -8.7449 0.0007 0.0008 0.0017 2.8385 14.3422 21.7985 40.3650
frequency: 13.7576 21.5851 40.2464 58.9124 76.3868 79.0186 123.0422 136.8422 159.9424 164.7376 176.5551 197.8796 215.2277 251.8947 272.4971 277.5821 303.6526 320.9719 345.0627 370.8100 380.1942 381.6750 406.5645 429.6096 448.0510 465.0526 506.1405 518.7197 564.3338 593.5718 623.3822 665.9334 716.5571 750.5874 781.0126 830.3666 843.8811 864.5957 888.8857 920.0988 928.6708 957.9322 978.7180 991.8830 1009.6995 1011.7656 1032.3144 1043.9655 1055.6595 1066.7874 1070.7077 1078.9674 1119.5109 1147.4378 1170.4703 1203.6682 1210.8934 1232.0879 1263.7603 1283.3795 1289.7595 1304.3782 1312.3048 1342.9778 1352.5998 1368.7415 1388.8491 1392.4598 1403.6710 1420.7411 1425.2508 1437.9729 1442.4756 1442.8867 1455.2650 1460.3988 1468.4386 1472.1148 1472.5881 1474.9279 1487.8216 1501.2506 1607.8849 1644.2710 2996.1628 3015.1101 3022.4540 3024.0332 3027.2375 3032.3391 3034.2814 3068.2836 3078.1134 3092.7576 3106.7808 3109.7040 3111.0938 3124.3853 3137.5979 3149.6627 3151.0061 3153.2862 3165.3790 3223.2038 3485.1576
redmass: 4.6212 5.9793 4.3562 3.7819 6.0872 5.2314 4.6806 2.8985 3.4489 1.1062 3.4211 3.7528 1.1356 2.9300 2.6117 1.1397 3.0131 3.2270 3.2037 2.3608 2.7400 3.0711 3.1161 1.4343 1.8541 2.6257 4.2080 3.0713 3.7501 3.8859 1.4683 4.1870 2.8805 5.0333 2.2632 3.2737 1.8812 2.0961 3.3670 2.5771 2.3971 2.7527 1.9103 2.9144 1.3035 1.3919 2.8748 1.9550 1.5166 1.6165 1.8728 4.3838 1.4363 1.4970 1.5074 1.5260 1.6481 1.2936 1.2414 1.3591 2.9226 1.1979 1.2810 1.2930 1.2492 1.1268 1.3110 1.2741 1.1619 1.2566 1.1563 1.1182 1.0835 1.0813 1.0879 1.0444 1.0789 1.0699 1.0638 1.0766 1.0528 1.0522 8.8033 5.0809 1.0372 1.0586 1.0769 1.0447 1.0512 1.0379 1.0603 1.0587 1.0974 1.1065 1.1049 1.0925 1.0697 1.1052 1.1052 1.1053 1.1051 1.1114 1.1045 1.1162 1.0661
irintensity: 0.5487 0.8066 0.0814 1.8997 2.6144 8.8467 1.4069 5.2727 2.6978 0.5390 3.3473 9.6880 2.5374 8.5948 3.7401 0.5357 13.2565 4.0780 12.3045 4.2671 4.6005 9.0184 1.4861 100.2403 30.5912 6.2250 3.7515 5.2736 21.1542 0.9151 11.2400 13.8001 16.4939 13.1042 9.6242 21.9549 1.1235 7.2893 20.2121 24.8285 5.8681 57.6644 22.5027 4.0084 49.7354 15.2100 0.8719 28.1505 8.9204 3.1711 3.3415 366.6510 8.9006 52.8341 13.2254 4.2431 0.2613 10.1620 5.9866 40.2949 38.9929 10.2630 7.3430 0.3245 12.6934 14.1685 10.1405 10.1822 25.2093 14.7181 27.0108 3.5229 2.6018 16.9990 2.5913 20.0016 39.5726 4.9606 62.3090 28.9997 36.5318 66.6356 171.5768 4.3356 9.4945 3.9664 5.3184 0.4224 14.0414 33.6282 6.2867 5.9372 13.2882 4.0146 4.8957 15.4383 0.3717 4.2512 4.0339 3.4326 3.0417 0.6269 9.8555 1.9650 46.9894
temp: 298.150 k
press: 1.00000 atm
elementType: 17 8 8 8 7 6 6 6 6 6 6 6 6 6 6 6 1 1 1 1 1 1 1 1 1 1 1 1 1 1 1 1 1 1 1 1 1
symmnumber: 1
zpe: 823761.4 jmol-1
zpe.correction: 0.313754 hartree
zpe.thermalcorrener: 0.332943 hartree
zpe.thermalcorrenthalpy: 0.333888 hartree
zpe.thermalcorrgfe: 0.264171 hartree
zpe.sumelectzpe: -1170.678150 hartree
zpe.sumelectthermal: -1170.658961 hartree
zpe.sumelectthermalent: -1170.658017 hartree
zpe.sumelectthermalfe: -1170.727734 hartree
dipole: 3.1559 4.8906 -2.3583
dipole: 6.2801
quadrupole: -68.3889 -80.9708 -93.3133
quadrupole: 10.1885 -4.0817 0.5851
quadrupole: 12.5021 -0.0798 -12.4223 10.1885 -4.0817 0.5851
hfenergy: -1170.9919046 hartree
pointgroup: C01 [X(C11H21Cl1N1O3)]
dipole: 1.4363433 1.7672366 -0.9584027 debye
polarizability: 170.4281525|13.798138|126.8205754|1.2384251|-12.1208388|133.6451321 unknown
InChI: InChI=1S/C11H21ClNO3/c1-9(2)11(15)16-6-5-13(3,4)8-10(14)7-12/h10,14H,1,5-8H2,2-4H3
charge 1 multiplicity 1
37 atoms
Cl 4.952859 -1.739862 0.45337
O  1.837851 -1.759403 0.150553
O  -2.242057 0.873776 -0.781422
O  -2.043427 0.192176 1.436695
N  1.405324 1.220101 0.18528
C  2.710579 0.542656 -0.311335
C  0.222231 0.836651 -0.73457
C  1.647213 2.730244 0.146254
C  1.111857 0.795747 1.635024
C  2.574001 -0.924526 -0.794817
C  -1.04817 1.703435 -0.538466
C  3.951658 -1.511797 -1.135594
C  -2.686647 0.138093 0.357335
C  -3.930586 -0.623244 0.063817
C  -4.541412 -0.537776 -1.319126
C  -4.454225 -1.356721 1.08871
H  3.079074 1.157722 -1.152177
H  3.429887 0.609992 0.523626
H  -0.003219 -0.21804 -0.512705
H  0.589946 0.920951 -1.771541
H  1.712379 3.063935 -0.901263
H  0.823732 3.248267 0.657883
H  2.591543 2.95151 0.666952
H  0.110121 1.145226 1.922187
H  1.88696 1.231343 2.284523
H  1.131726 -0.300979 1.672311
H  1.982767 -0.955535 -1.729377
H  -1.116812 2.509932 -1.283178
H  -1.110046 2.124599 0.480794
H  3.851183 -2.519126 -1.56358
H  4.553519 -0.866271 -1.792313
H  2.48203 -2.223377 0.751701
H  -4.801346 0.503989 -1.577781
H  -3.838161 -0.891885 -2.093868
H  -5.456484 -1.149171 -1.374487
H  -5.371577 -1.939267 0.955839
H  -3.974171 -1.378067 2.073249
