program: Gaussian 09
title: 000106661
version: EM64L-G09RevD.01
frameworkgroup: C1[X(C15H16O6)]
method: RPBEPBE
basis: SDD
operation: Freq
keyword: #pfreq=noraman
keyword: PBEPBE/SDD
title: #p freq=noraman PBEPBE/SDD
converged: YES YES NO NO
title: Mulliken charges:
elementType: O O O O O O C C C C C C C C C C C C C C C H H H H H H H H H H H H H H H H
charge: -0.280587 -0.267717 -0.248943 -0.426195 -0.249349 -0.237061 0.045334 -0.353508 -0.721207 0.143851 0.203502 0.225041 -0.358566 -0.325150 -0.218802 -0.218306 0.164703 0.093510 0.377424 -0.786111 -0.638322 0.235116 0.242216 0.239323 0.259961 0.232198 0.258129 0.274494 0.265429 0.241140 0.240092 0.238241 0.256861 0.217002 0.230877 0.257398 0.387983
chargesum: 0.00000
title: Mulliken charges with hydrogens summed into heavy atoms:
elementType: O O O O O O C C C C C C C C C C C C C C C
charge: -0.280587 -0.267717 -0.248943 -0.038212 -0.249349 -0.237061 0.280450 0.128031 0.029081 0.143851 0.203502 0.225041 -0.084072 -0.059721 0.022338 0.021786 0.164703 0.093510 0.377424 -0.074006 -0.150047
polarizability: 2.59697015e+02 6.02407509e+00 1.87590404e+02 2.38261699e+01 -2.77409795e+00 1.06142869e+02
1716.lowfreq: -9.6347 -4.1487 -0.0007 0.0005 0.0006 4.8685 12.1715 30.0436 35.5850
frequency: 11.0732 30.0163 35.5518 40.9053 59.7137 70.0682 76.5586 84.5728 110.9681 119.1483 173.4767 177.7937 195.2675 203.4771 209.1006 227.0471 249.0204 265.2051 315.3014 352.5885 366.0453 368.3266 387.6617 394.5631 404.4593 440.4500 466.7543 506.2223 547.2504 570.0257 585.0592 598.0959 617.7778 637.0504 652.8691 675.1646 710.6158 750.3728 764.2797 772.1145 783.2692 787.6413 799.8189 823.6712 877.9302 906.0781 924.5482 940.9164 974.3554 978.4181 991.3854 1001.6237 1006.1628 1015.3696 1033.6086 1060.6743 1070.4092 1075.5799 1095.3078 1112.3199 1118.7099 1153.9167 1163.2053 1178.4882 1238.4660 1257.2925 1276.2902 1289.2257 1309.2039 1320.6250 1325.9282 1368.2394 1380.8207 1394.1557 1398.8967 1418.9118 1429.0966 1446.1135 1459.3347 1464.1786 1476.7471 1479.0162 1487.0805 1577.3787 1601.4414 1614.7979 1615.0270 1646.4990 1655.1187 2974.7199 3004.9945 3007.7717 3031.5866 3058.6625 3092.1923 3103.2853 3104.8366 3109.4854 3121.8943 3140.2501 3154.5238 3167.8129 3178.2767 3216.7905 3516.4458
redmass: 6.0952 5.3515 5.6023 5.5830 5.6248 4.7963 5.9508 3.8174 5.7214 5.3420 4.6650 4.2923 2.2150 1.0832 1.8750 3.0499 4.5056 5.0681 5.4271 6.8401 2.9998 3.6472 3.6352 3.2077 3.5420 3.8255 4.2137 3.8575 4.3161 3.6883 1.3565 4.9681 3.2829 1.7887 5.0088 4.8683 3.7904 6.0825 4.4235 3.8689 2.1279 1.8029 2.9630 6.6483 3.7805 1.4463 2.4029 1.8273 1.9544 1.4236 1.3339 4.9735 1.3683 1.3983 3.2834 1.8479 1.5997 2.8594 2.4885 1.8457 3.1094 1.9585 1.7676 1.0617 2.6688 1.1049 1.5418 3.4983 2.4703 1.7581 1.4810 1.3120 10.8324 1.2212 1.1584 1.2560 2.2065 1.0932 1.0444 1.0557 2.2484 1.1327 1.0571 7.3475 6.5506 10.0741 10.2551 9.1140 5.1013 1.0362 1.0384 1.0797 1.0618 1.0975 1.1004 1.0988 1.0620 1.1054 1.1013 1.0863 1.0908 1.0954 1.0996 1.1156 1.0640
irintensity: 0.2615 0.4649 0.3770 1.2017 6.0612 2.0794 1.6063 0.4620 3.3396 0.2694 5.1608 0.5230 1.0455 0.2859 0.5710 1.6785 7.5098 2.8123 11.7716 2.4011 2.2937 6.2166 10.4819 6.4412 3.7362 2.8815 3.3711 5.8463 31.2579 6.9601 96.3641 33.2905 2.2583 12.9294 8.6950 4.6418 106.7163 3.0471 7.7677 4.9383 8.3938 49.4944 19.4767 2.3025 26.2192 0.9380 7.8256 1.8911 32.5228 15.2279 51.6351 169.3551 4.1118 16.1865 100.5188 69.4144 45.8680 255.1021 239.3687 18.4378 130.6875 23.9398 54.2678 0.3262 260.3222 17.7960 68.8221 81.8580 75.3702 3.3775 10.2851 3.4331 14.4897 37.9569 13.7903 12.3145 9.3391 18.5910 13.7345 22.8337 27.9972 42.8731 20.0048 34.9854 59.7802 153.7390 88.8502 247.6126 2.2532 11.6740 9.0822 10.1609 36.3726 11.3120 27.4689 12.7692 5.1386 5.7748 9.6843 2.2191 6.9041 7.8980 16.1918 4.8210 34.9519
temp: 298.150 k
press: 1.00000 atm
elementType: 8 8 8 8 8 8 6 6 6 6 6 6 6 6 6 6 6 6 6 6 6 1 1 1 1 1 1 1 1 1 1 1 1 1 1 1 1
symmnumber: 1
zpe: 741737.5 jmol-1
zpe.correction: 0.282513 hartree
zpe.thermalcorrener: 0.303697 hartree
zpe.thermalcorrenthalpy: 0.304642 hartree
zpe.thermalcorrgfe: 0.229584 hartree
zpe.sumelectzpe: -1030.991613 hartree
zpe.sumelectthermal: -1030.970428 hartree
zpe.sumelectthermalent: -1030.969484 hartree
zpe.sumelectthermalfe: -1031.044542 hartree
dipole: -1.8928 3.1710 -1.6346
dipole: 4.0386
quadrupole: -107.8269 -114.8472 -127.1779
quadrupole: 3.7196 5.6309 5.3120
quadrupole: 8.7904 1.7701 -10.5605 3.7196 5.6309 5.3120
hfenergy: -1031.2741255 hartree
pointgroup: C01 [X(C15H16O6)]
dipole: -0.7273381 -1.206482 0.734821 debye
polarizability: 250.0324671|-10.0357296|188.5544546|-42.7924182|0.5105043|114.843366 unknown
InChI: InChI=1S/C15H16O6/c1-9(2)14(18)20-8-10(3)21-15(19)12-7-5-4-6-11(12)13(16)17/h4-7,10,16H,1,8H2,2-3H3
charge 0 multiplicity 1
37 atoms
O  -0.191153 1.134356 0.414269
O  2.573605 0.084879 0.538077
O  -1.599899 2.794388 -0.425926
O  -0.796909 -2.572442 0.44267
O  4.588367 0.998466 -0.224404
O  -0.506548 -1.098755 -1.326582
C  1.019726 1.972967 0.106533
C  2.129711 1.422282 1.002247
C  1.328537 1.924433 -1.394946
C  -2.525537 0.649326 0.28083
C  -1.423804 1.632905 0.018282
C  -2.360705 -0.767116 0.257616
C  -3.781095 1.197415 0.640556
C  -3.439947 -1.597878 0.650861
C  -4.857264 0.361971 1.005196
C  -4.680664 -1.039908 1.02614
C  3.825238 0.009601 -0.094982
C  -1.137052 -1.4293 -0.297794
C  4.090968 -1.390173 -0.567176
C  2.990277 -2.423261 -0.435618
C  5.314114 -1.642693 -1.109283
H  0.786774 3.008441 0.425983
H  2.994244 2.110353 0.99317
H  1.759265 1.269985 2.028443
H  1.361592 0.879424 -1.743068
H  2.307261 2.398448 -1.589507
H  0.554651 2.46262 -1.964275
H  -3.88876 2.286711 0.637657
H  -3.299722 -2.682512 0.644997
H  -5.821019 0.80182 1.281846
H  -5.505354 -1.696584 1.322229
H  2.699559 -2.550768 0.623263
H  2.088567 -2.09078 -0.984231
H  3.320345 -3.395977 -0.838292
H  5.578715 -2.637876 -1.482317
H  6.063111 -0.847106 -1.186059
H  0.004007 -2.995165 0.028794
