program: Gaussian 09
title: 000106274
version: EM64L-G09RevD.01
frameworkgroup: C1[X(C13H10N3O4S)]
method: RPBEPBE
basis: SDD
operation: Freq
keyword: #p
keyword: freq=noraman
keyword: PBEPBE/SDD
title: #p freq=noraman PBEPBE/SDD
converged: YES YES NO NO
title: Mulliken charges:
elementType: S O O O O N N N C C C C C C C C C C C C C H H H H H H H H H H
charge: 1.030776 -0.547201 -0.421599 -0.467257 -0.230099 -0.493123 0.040894 0.167212 -0.313673 0.576526 0.579626 -0.551310 -0.166649 -0.308402 0.256130 0.181753 -0.312568 -0.331291 -0.210585 -0.228893 -0.204581 0.287271 0.308069 0.356992 0.334330 0.281035 0.200639 0.257738 0.250725 0.258242 0.419275
chargesum: 1.00000
title: Mulliken charges with hydrogens summed into heavy atoms:
elementType: S O O O O N N N C C C C C C C C C C C C C
charge: 1.030776 -0.127926 -0.421599 -0.467257 -0.230099 -0.158793 0.040894 0.167212 -0.313673 0.576526 0.579626 -0.264039 0.141419 0.048590 0.256130 0.181753 -0.031533 -0.130653 0.047153 0.021833 0.053660
polarizability: 4.27923717e+02 1.46252158e+01 2.22755974e+02 -2.67635143e+00 -1.59786563e+00 9.74602282e+01
1716.lowfreq: -6.3382 -0.0016 -0.0012 -0.0009 1.5554 4.5370 12.8520 21.8380 28.9100
frequency: 12.5790 21.7860 28.8946 50.3269 72.3179 84.4557 115.0215 133.6896 150.3282 157.6709 175.1561 193.6430 215.6232 254.6429 274.7338 289.6156 305.3618 324.0587 350.2077 360.5552 373.6525 396.1284 405.0797 423.2010 469.9747 499.4901 507.5447 549.6069 558.6011 604.8249 611.6260 614.2431 646.4884 664.8859 686.2748 703.7746 710.9905 727.3466 793.8348 826.2195 845.8909 855.8886 872.3163 888.2644 916.2220 940.8932 972.6939 987.4350 992.9268 994.5010 1009.7985 1018.6037 1021.2427 1047.5007 1058.9102 1099.1674 1141.4536 1165.1772 1184.3411 1200.1421 1235.3521 1267.4584 1296.9584 1326.5139 1332.5362 1392.3909 1416.5208 1437.0257 1464.9878 1480.4105 1487.2951 1541.9010 1575.0976 1578.2213 1606.1011 1624.8438 2094.7006 3106.2223 3149.8789 3155.6147 3157.5499 3159.6706 3169.9332 3181.3411 3182.0080 3465.1388 3519.3599
redmass: 9.6638 6.0538 5.2518 6.7569 7.2052 6.1274 7.9139 5.8163 9.3706 6.4092 11.2076 5.3217 4.8422 3.3136 6.9424 4.5432 2.0369 7.0928 10.4780 6.7908 4.9480 2.8138 10.2382 4.4848 5.6517 4.1323 8.1006 7.5095 12.7822 3.7965 6.5929 6.1020 1.5807 6.2078 2.5307 2.5653 1.9054 6.9157 2.4751 15.3429 1.3695 4.4328 1.3393 1.9622 4.9148 1.4159 11.4426 5.2549 1.4366 6.5583 1.4109 1.4310 2.6998 2.5220 1.2057 1.6465 1.8300 1.7036 1.0610 1.1248 2.9963 1.4860 2.2293 1.5414 2.7109 8.4668 7.1620 2.2555 2.2098 2.4343 2.5680 6.7079 4.6775 5.5847 5.6967 5.3179 13.9118 1.0894 1.0875 1.0934 1.0924 1.0912 1.0961 1.0961 1.1015 1.0665 1.0767
irintensity: 3.5429 0.0113 0.5615 4.1783 4.0412 3.1426 10.1049 2.3480 2.4614 0.5068 0.1688 5.5900 5.4216 14.4884 31.7926 39.6202 84.3697 17.3876 1.0979 2.6357 4.5752 4.3566 65.4211 0.2243 1.1146 16.6339 13.5021 7.9433 151.9363 24.7047 6.7268 122.1120 16.1965 10.1359 7.2830 8.5769 133.2397 0.9928 17.6356 60.5214 2.3382 3.2934 8.7679 72.0870 41.8604 2.8832 68.5349 20.2098 0.7010 18.0937 4.8952 6.3747 31.1506 79.4288 105.8869 9.2660 40.5616 76.6016 3.5136 50.4755 430.2531 0.7807 84.1858 50.8096 141.2430 2.9699 39.8970 8.6256 19.2711 29.1938 428.7717 13.6813 67.1452 169.8826 56.6261 401.3927 361.3963 18.2220 0.1321 4.9997 12.4413 4.8519 4.5612 42.4844 11.6401 140.3188 62.2794
temp: 298.150 k
press: 1.00000 atm
elementType: 16 8 8 8 8 7 7 7 6 6 6 6 6 6 6 6 6 6 6 6 6 1 1 1 1 1 1 1 1 1 1
symmnumber: 1
zpe: 556041.4 jmol-1
zpe.correction: 0.211785 hartree
zpe.thermalcorrener: 0.231436 hartree
zpe.thermalcorrenthalpy: 0.232381 hartree
zpe.thermalcorrgfe: 0.160645 hartree
zpe.sumelectzpe: -1362.632403 hartree
zpe.sumelectthermal: -1362.612751 hartree
zpe.sumelectthermalent: -1362.611807 hartree
zpe.sumelectthermalfe: -1362.683543 hartree
dipole: -0.8066 5.2939 1.9875
dipole: 5.7119
quadrupole: -51.2974 -106.9892 -128.4984
quadrupole: -5.9964 12.4235 -3.0496
quadrupole: 44.2976 -11.3942 -32.9034 -5.9964 12.4235 -3.0496
hfenergy: -1362.8441878 hartree
pointgroup: C01 [X(C13H10N3O4S1)]
dipole: -0.2486669 -2.1432724 -0.6281617 debye
polarizability: 428.6456871|-7.705985|221.1462365|3.7911545|-10.5364194|98.3479954 unknown
InChI: InChI=1S/C13H10N3O4S/c14-16-11-8-10(6-7-12(11)21(18,19)20)15-13(17)9-4-2-1-3-5-9/h1-8,15,18H
charge 1 multiplicity 1
31 atoms
S  4.737738 0.731998 0.115986
O  4.906846 0.784683 -1.709266
O  5.068773 2.156784 0.779321
O  5.337657 -0.670562 0.672464
O  -2.107251 1.943621 -0.199651
N  -1.300455 -0.252104 -0.023971
N  3.188135 -1.986783 -0.046343
N  3.688545 -3.027495 -0.114688
C  2.886895 0.453587 0.058603
C  0.067568 0.005238 -0.001865
C  2.363051 -0.865699 -0.007275
C  0.962225 -1.102504 -0.034811
C  2.010559 1.539108 0.085404
C  0.614452 1.331968 0.067153
C  -3.740027 0.15291 -0.027251
C  -2.362544 0.71278 -0.083643
C  -4.794925 1.002943 -0.459729
C  -4.044435 -1.152804 0.452932
C  -6.126816 0.547413 -0.435744
C  -5.37993 -1.602083 0.479566
C  -6.422023 -0.75653 0.028998
H  0.587274 -2.130434 -0.08398
H  2.412804 2.55624 0.144844
H  -0.076078 2.178303 0.091332
H  -1.593533 -1.232168 -0.05591
H  -4.548518 2.010435 -0.809369
H  -3.269613 -1.814749 0.862361
H  -6.933398 1.204216 -0.775423
H  -5.612414 -2.600974 0.861534
H  -7.458098 -1.109593 0.050145
H  5.830035 1.083954 -1.963424
