program: Gaussian 09
title: 000106243
version: EM64L-G09RevD.01
frameworkgroup: C1[X(C14H16O3S)]
method: RPBEPBE
basis: SDD
operation: Freq
keyword: #p
keyword: freq=noraman
keyword: PBEPBE/SDD
title: #p freq=noraman PBEPBE/SDD
converged: YES YES NO NO
title: Mulliken charges:
elementType: S O O O C C C C C C C C C C C C C C H H H H H H H H H H H H H H H H
charge: 0.966923 -0.563300 -0.505632 -0.504896 -0.597846 0.431885 0.218560 -0.363781 0.498862 -0.323111 -0.341101 -0.470490 -0.292631 -0.385421 -0.396069 -0.693946 -0.266843 -0.247851 0.214398 0.227825 0.217481 0.212267 0.194280 0.198403 0.253422 0.295057 0.246844 0.280595 0.212270 0.213845 0.219748 0.233492 0.237020 0.379739
chargesum: 0.00000
title: Mulliken charges with hydrogens summed into heavy atoms:
elementType: S O O O C C C C C C C C C C C C C C
charge: 0.966923 -0.183561 -0.505632 -0.504896 -0.155622 0.431885 0.218560 0.065968 0.498862 -0.323111 0.051583 -0.217068 0.002426 -0.138577 -0.115475 -0.048083 -0.033350 -0.010831
polarizability: 2.47739199e+02 -4.12581363e+00 2.14987770e+02 1.25790639e+01 1.04331048e+01 1.16571272e+02
1716.lowfreq: -8.5045 -0.0021 -0.0007 0.0007 5.0131 9.8619 33.9216 39.1836 48.1655
frequency: 33.7975 38.8053 48.0956 75.1951 87.1839 125.3935 140.8203 150.5801 162.6596 174.3898 198.2417 203.7887 232.0969 241.6174 269.0612 300.9140 313.4913 324.5715 352.6080 407.7591 420.1668 435.1500 471.4181 482.7905 505.7443 519.1359 545.0816 596.8451 629.7372 653.7123 712.3734 734.6889 776.7946 779.0543 796.6101 803.0900 827.6735 854.9069 877.1050 885.8003 905.7046 924.3539 957.7034 966.5962 972.8550 998.2072 1001.0639 1022.4160 1041.6694 1050.0730 1068.7639 1098.1531 1107.5671 1132.5883 1165.7706 1182.3853 1193.8191 1207.3176 1244.3903 1259.4068 1273.9252 1285.0669 1290.7227 1322.7602 1349.5940 1366.2655 1378.6443 1396.2686 1409.1968 1433.3155 1450.4843 1469.4749 1474.9104 1479.6621 1485.5233 1495.5379 1515.6572 1575.2029 1593.6147 1628.9416 2964.8490 2976.2194 2978.8098 2989.5667 3006.4030 3028.2384 3053.0039 3073.5102 3075.6962 3136.1807 3139.9259 3151.0189 3161.6514 3165.4507 3175.8670 3477.0147
redmass: 7.2230 4.6564 4.6272 1.5446 4.5699 3.1563 4.9164 3.4228 4.2452 2.0237 5.6926 3.9750 1.1604 2.7855 3.2325 7.4887 4.3369 4.0268 5.0058 3.9279 7.3905 3.3007 3.3678 4.3654 4.5777 7.3540 11.5469 3.8794 5.1923 3.6141 4.4868 1.0799 1.4872 3.6137 1.4469 2.1951 10.7593 1.3586 3.9802 1.8886 1.9092 1.3063 7.7648 1.4815 1.4225 1.3548 4.1576 3.0712 2.1011 1.1845 2.6074 1.8237 2.0969 1.9325 1.6596 1.2532 1.4242 1.4700 1.6678 1.3635 1.2902 1.3691 1.2284 1.4326 1.5397 3.1883 2.1615 1.2132 5.2528 2.6427 2.4675 1.0660 1.0815 1.0416 1.0820 1.1491 3.0151 7.8386 5.9416 6.4185 1.0592 1.0379 1.0580 1.0597 1.0994 1.1016 1.1040 1.1008 1.0994 1.0859 1.0892 1.0897 1.0955 1.0954 1.0995 1.0661
irintensity: 0.2213 0.4921 0.0930 0.0037 0.2531 0.1128 2.3775 0.4616 8.4519 32.7168 3.8862 3.0314 0.7961 28.0310 19.3181 20.0432 19.8589 13.2073 3.2470 0.9969 70.4413 19.1014 1.7374 11.3429 3.0021 13.4119 124.9109 2.6800 24.5406 0.8765 4.0638 7.1005 71.4494 7.7902 2.6056 1.8231 81.5603 34.5985 6.5190 2.1638 7.3272 1.3012 87.2640 6.7692 1.7713 0.0404 0.1836 5.0467 5.8954 85.4931 3.7458 8.9102 16.3074 0.7621 1.3621 7.2960 7.6931 0.6824 6.0806 3.6651 1.1162 8.0812 5.1853 3.5756 0.1585 8.2332 15.6261 12.3512 7.2061 7.8914 5.4950 0.4353 1.0961 13.4140 5.9742 18.7386 24.7712 10.2764 9.7637 3.2440 25.0192 28.5351 12.2623 66.9751 4.6277 1.3693 31.0270 77.5895 51.7503 2.2907 11.0100 13.4540 7.4051 12.7569 16.9933 40.7985
temp: 298.150 k
press: 1.00000 atm
elementType: 16 8 8 8 6 6 6 6 6 6 6 6 6 6 6 6 6 6 1 1 1 1 1 1 1 1 1 1 1 1 1 1 1 1
symmnumber: 1
zpe: 699324.5 jmol-1
zpe.correction: 0.266359 hartree
zpe.thermalcorrener: 0.284607 hartree
zpe.thermalcorrenthalpy: 0.285551 hartree
zpe.thermalcorrgfe: 0.219399 hartree
zpe.sumelectzpe: -1165.332075 hartree
zpe.sumelectthermal: -1165.313827 hartree
zpe.sumelectthermalent: -1165.312883 hartree
zpe.sumelectthermalfe: -1165.379035 hartree
dipole: -5.6567 1.3344 0.6137
dipole: 5.8443
quadrupole: -119.1355 -107.4310 -117.4926
quadrupole: 5.6994 11.6339 2.3421
quadrupole: -4.4492 7.2554 -2.8062 5.6994 11.6339 2.3421
hfenergy: -1165.5984339 hartree
pointgroup: C01 [X(C14H16O3S1)]
dipole: 2.2003315 -0.6178508 0.2522128 debye
polarizability: 246.963599|-6.5890666|214.0527375|-14.1607237|-15.2223005|118.2819044 unknown
InChI: InChI=1S/C14H16O3S/c1-2-3-6-11-9-10-14(18(15,16)17)13-8-5-4-7-12(11)13/h4-5,7-10,15H,2-3,6H2,1H3
charge 0 multiplicity 1
34 atoms
S  -3.389215 0.976362 0.182481
O  -3.272246 0.750732 2.027858
O  -3.787732 2.510837 -0.141542
O  -4.330362 -0.213574 -0.388242
C  2.698213 0.58082 -0.998417
C  1.202324 0.594389 -0.72968
C  0.485924 -0.611514 -0.367097
C  3.5480 0.590981 0.306146
C  -0.940155 -0.557511 -0.069914
C  -1.556249 0.730695 -0.163875
C  5.066695 0.572928 0.021516
C  0.506803 1.808968 -0.801789
C  -0.883427 1.894685 -0.510699
C  1.140566 -1.885916 -0.284553
C  -1.635084 -1.759508 0.287636
C  5.912765 0.595698 1.312637
C  0.442147 -3.041639 0.066798
C  -0.954641 -2.975541 0.356079
H  2.985348 -0.298616 -1.606889
H  2.967192 1.472833 -1.595145
H  3.277978 -0.279229 0.936488
H  3.291207 1.492748 0.896817
H  5.317704 -0.330337 -0.571754
H  5.331205 1.444113 -0.61188
H  1.044454 2.72084 -1.08313
H  -1.41954 2.847458 -0.564823
H  2.209496 -1.951444 -0.507887
H  -2.708196 -1.720384 0.49232
H  5.689266 -0.280688 1.949489
H  5.703803 1.504237 1.907928
H  6.994398 0.581827 1.085914
H  0.963142 -4.003494 0.119551
H  -1.496568 -3.887067 0.629213
H  -4.206713 0.786009 2.387046
