program: Gaussian 09
title: 000106216
version: EM64L-G09RevD.01
frameworkgroup: C1[X(C8H12N2S)]
method: RPBEPBE
basis: SDD
operation: Freq
keyword: #p
keyword: freq=noraman
keyword: PBEPBE/SDD
title: #p freq=noraman PBEPBE/SDD
converged: NO NO NO NO
title: Mulliken charges:
elementType: S N N C C C C C C C C H H H H H H H H H H H H
charge: 0.181496 -0.025311 0.046443 -0.184262 0.378733 -0.695775 -0.695779 -0.462870 -0.301455 -0.284313 -0.818091 0.226742 0.239455 0.216340 0.219722 0.219720 0.216338 0.239461 0.240241 0.240850 0.280506 0.241301 0.280507
chargesum: 0.00000
title: Mulliken charges with hydrogens summed into heavy atoms:
elementType: S N N C C C C C C C C
charge: 0.181496 -0.025311 0.046443 0.042480 0.378733 -0.020257 -0.020260 -0.462870 -0.061214 -0.043463 -0.015777
polarizability: 1.43120701e+02 -7.15801966e+00 1.41273672e+02 5.80194659e-04 -4.67868395e-03 7.02717674e+01
1716.lowfreq: -11.4097 -0.0014 -0.0010 0.0010 11.5852 13.1628 19.8991 65.1776 86.0919
frequency: 19.2904 65.1017 86.0747 125.3693 145.9418 178.4929 206.7765 210.7581 241.1358 268.4230 336.5209 351.9193 405.0103 474.6473 486.8197 569.4633 583.7921 652.1690 667.5983 795.3925 802.0198 852.0901 887.1532 923.8473 942.1378 960.5554 978.0581 986.6996 1010.1036 1042.1834 1081.9720 1108.2373 1146.4251 1185.2187 1232.7391 1263.3722 1297.7298 1315.3183 1345.9816 1371.7306 1375.6948 1390.5977 1412.1427 1434.0502 1449.8219 1462.2283 1470.8015 1476.5361 1488.2086 1497.4359 1500.4594 2980.5592 2982.1460 3004.9470 3021.9413 3075.3375 3079.3164 3090.1090 3096.2530 3133.5216 3146.0595 3152.8468 3160.9678
redmass: 2.8161 3.8762 4.4315 1.0572 3.7100 2.8393 2.8286 1.1035 1.3779 2.0220 4.2153 3.6808 5.8953 8.2614 4.2297 3.6219 4.7806 4.3928 7.0566 7.9462 5.3229 1.2240 2.8022 1.1564 1.4619 1.4794 1.1800 1.3257 3.8096 2.7596 1.7524 2.6235 2.3173 2.2939 6.1230 2.3530 1.3193 1.8217 1.1464 1.1885 1.6427 1.3367 1.8315 1.0526 1.0591 1.0448 1.0491 1.0483 1.5777 2.9616 3.2742 1.0344 1.0352 1.0837 1.0283 1.1006 1.0997 1.1009 1.1000 1.0877 1.1040 1.1053 1.0992
irintensity: 0.3620 3.4847 0.0060 0.2293 2.2859 0.5295 0.4315 0.0087 0.2722 0.5573 8.0279 1.7350 6.0057 3.3827 3.3877 0.0253 2.8069 2.3825 2.1698 0.0033 8.1709 31.8338 5.0491 5.1109 0.0064 0.0533 6.9490 5.6965 30.5509 19.2715 18.1364 0.3054 51.5469 19.5623 14.4959 2.5721 0.0611 50.7160 0.4638 16.5888 48.7858 12.7081 21.0249 14.2704 20.4431 6.0803 1.8476 14.9928 36.1965 35.2697 2.7098 35.8068 32.6942 14.3214 21.5903 19.1543 55.9760 3.5236 37.9118 1.7305 8.5274 10.6495 46.5821
temp: 298.150 k
press: 1.00000 atm
elementType: 16 7 7 6 6 6 6 6 6 6 6 1 1 1 1 1 1 1 1 1 1 1 1
symmnumber: 1
zpe: 487396.0 jmol-1
zpe.correction: 0.185639 hartree
zpe.thermalcorrener: 0.197836 hartree
zpe.thermalcorrenthalpy: 0.198780 hartree
zpe.thermalcorrgfe: 0.146114 hartree
zpe.sumelectzpe: -818.763706 hartree
zpe.sumelectthermal: -818.751509 hartree
zpe.sumelectthermalent: -818.750565 hartree
zpe.sumelectthermalfe: -818.803232 hartree
dipole: 0.9993 0.3819 0.0000
dipole: 1.0698
quadrupole: -70.5906 -68.2854 -75.5619
quadrupole: 1.0024 -0.0002 -0.0005
quadrupole: 0.8887 3.1939 -4.0826 1.0024 -0.0002 -0.0005
hfenergy: -818.9493454 hartree
pointgroup: C01 [X(C8H12N2S1)]
dipole: 0.4134882 0.0786289 -0.0000065 debye
dipolederiv: -0.095688 0.2488822 -0.0000204 0.3920442 -0.5950642 0.0000299 -0.0000392 0.0000411 -0.1050126 -0.3103712 0.1335881 -0.0000083 -0.2149307 -0.0386727 0.000001 0.0000273 -0.0000047 -0.2460782 -0.2188931 -0.2655411 0.0000243 0.267625 -0.6119636 0.000032 -0.0000217 0.0000256 -0.1904044 -0.0851538 -0.1387484 0.0000111 -0.0506213 0.0983217 -0.0000106 0.0000031 -0.0000169 0.0360388 0.3503068 0.6512078 -0.0000467 0.4430049 -0.1303501 -0.0000031 -0.0000531 -0.0000036 0.0542946 0.010803 0.0132686 -0.0440586 -0.0521188 0.0218493 -0.0066182 0.0411701 0.0579429 -0.0099679 0.0107958 0.0132836 0.0440614 -0.0521233 0.021824 0.0066062 -0.0411521 -0.0579484 -0.0099518 -0.0720261 -0.6030317 0.0000419 -0.6173157 1.1055805 -0.0000692 0.0000569 -0.0000692 0.0159385 -0.0442277 -0.4437903 0.0000294 0.0936298 0.1094169 -0.0000212 -0.0000032 -0.0000304 -0.0552009 0.212344 0.3906203 -0.0000206 -0.0957949 0.1467785 -0.0000069 0.0000056 0.0000024 -0.0264451 0.192118 -0.0375451 -0.0000009 -0.0647505 0.0378098 0.0000026 0.0000058 -0.0000017 0.0585812 -0.0143135 0.1103659 -0.0000148 0.1096878 -0.0663167 0.000013 -0.0000144 0.0000147 0.0328978 0.0705542 0.0558191 -0.0202811 0.1159998 -0.0622546 0.0303088 0.0103388 -0.0215506 0.0824221 -0.0990416 -0.1438365 -0.0374399 -0.1558065 -0.0264253 -0.0047399 -0.0255955 0.007229 0.0746037 0.028486 0.0360045 0.1275581 0.0201494 0.0875475 -0.023011 0.078987 -0.0174919 -0.1161378 0.0284894 0.035978 -0.1275615 0.0201341 0.0875545 0.022968 -0.0789831 0.0174531 -0.1161599 -0.0990567 -0.1438266 0.0374694 -0.1558024 -0.0264132 0.0047598 0.0256277 -0.0072075 0.0746066 0.0705736 0.0558183 0.0202596 0.1159929 -0.0622521 -0.0302759 -0.0103691 0.0215812 0.0824247 0.080606 0.0688796 -0.0000056 0.013897 -0.1186598 0.0000211 -0.0000025 0.0000279 0.1430276 0.0050196 -0.1351251 0.0000083 -0.0714853 -0.0488558 0.0000103 0.000003 0.0000073 0.1342562 -0.0239712 0.0099809 0.0377416 -0.0815708 0.0735816 0.0880537 0.0345921 0.0604736 -0.0199391 0.026617 0.0777783 -0.0000039 0.1017365 -0.0765954 0.0000152 -0.0000055 0.0000149 0.1261151 -0.0239704 0.0099697 -0.0377427 -0.0815814 0.0735593 -0.0880656 -0.0345781 -0.0604889 -0.0199092 unknown
polarizability: 140.5802975|-7.0339033|143.814075|-0.0002533|-0.0047077|70.2717674 unknown
InChI: InChI=1S/C8H12N2S/c1-6(2)7-8(11-3)10-5-4-9-7/h4-6H,1-3H3
charge 0 multiplicity 1
23 atoms
S  1.353895 -1.977568 0.000168
N  -0.993383 1.382546 -0.000074
N  1.763137 0.73911 -0.000027
C  -1.69449 -0.979881 0.000148
C  -0.596119 0.075639 0.000018
C  -2.562724 -0.847515 -1.279125
C  -2.562754 -0.847162 1.279366
C  0.807928 -0.229737 0.000037
C  -0.035198 2.357501 -0.000135
C  1.338775 2.036131 -0.000111
C  3.218325 -1.751568 0.000112
H  -1.221704 -1.980915 0.000292
H  -3.019746 0.156664 -1.318554
H  -3.367449 -1.605395 -1.274548
H  -1.959196 -0.991202 -2.19398
H  -1.959264 -0.990673 2.194276
H  -3.367522 -1.605001 1.274958
H  -3.019719 0.157053 1.318546
H  -0.383668 3.394999 -0.000226
H  2.114754 2.808926 -0.000149
H  3.528073 -1.198183 -0.897375
H  3.633737 -2.771937 0.00019
H  3.528111 -1.198031 0.897493
