program: Gaussian 09
title: 000106200
version: EM64L-G09RevD.01
frameworkgroup: C1[X(C10H14N2O2)]
method: RPBEPBE
basis: SDD
operation: Freq
keyword: #p
keyword: freq=noraman
keyword: PBEPBE/SDD
title: #p freq=noraman PBEPBE/SDD
converged: YES YES NO NO
title: Mulliken charges:
elementType: O O N N C C C C C C C C C C H H H H H H H H H H H H H H
charge: -0.308573 -0.261768 -0.415381 -0.455679 0.341163 0.549421 0.163302 -0.619968 -0.415796 -0.302754 -0.638465 0.210253 -0.530320 -0.785129 0.226505 0.305087 0.235255 0.331605 0.295956 0.223518 0.223584 0.224161 0.255207 0.255213 0.209264 0.223661 0.223844 0.236833
chargesum: 0.00000
title: Mulliken charges with hydrogens summed into heavy atoms:
elementType: O O N N C C C C C C C C C C
charge: -0.308573 -0.261768 -0.083776 -0.159723 0.341163 0.549421 0.163302 -0.393463 -0.110708 -0.067499 0.032798 0.210253 0.154018 -0.065445
polarizability: 2.06450139e+02 2.95979238e+00 1.48072478e+02 2.22200460e-03 6.78018495e-02 6.90020272e+01
1716.lowfreq: 0.0006 0.0007 0.0010 5.4590 11.1128 12.8086 51.5726 55.4280 65.4882
frequency: 51.5692 55.4126 65.4624 92.5681 114.6566 122.5004 154.9340 165.4246 181.5109 229.2268 242.5677 257.8031 291.8388 355.1377 377.5928 388.5256 439.4584 465.1619 469.0560 541.6331 581.6477 585.7252 619.6948 621.1978 650.0832 722.6044 740.4649 776.5111 812.4240 838.9430 893.0560 938.7398 967.8713 994.1352 1004.7419 1038.5964 1073.1784 1116.1469 1127.1146 1128.0992 1151.8156 1171.0487 1197.6743 1206.2697 1246.5678 1271.7602 1323.5312 1385.9636 1391.1737 1418.6113 1438.0787 1448.5319 1451.4682 1464.2592 1465.1296 1467.1427 1470.0755 1479.1216 1502.0276 1513.9436 1544.2909 1610.6767 1620.9019 1631.5311 2931.0076 2959.1189 2988.1544 2993.0319 3045.8013 3090.7215 3094.0899 3096.6411 3120.0202 3126.9482 3153.9611 3205.5342 3537.7873 3588.7132
redmass: 1.5540 5.0764 1.7995 3.1606 3.2275 3.9213 1.6259 3.3585 1.6813 4.2024 1.2453 3.0077 5.0554 4.3433 3.6745 5.0537 1.7200 1.4600 4.8142 4.4439 4.1159 3.3036 1.5905 5.5381 2.2246 2.4138 4.8949 5.1645 1.4660 1.8988 4.5245 1.3227 3.0530 4.9869 1.9414 1.6190 3.0855 1.2598 1.2797 1.5056 1.4447 1.7981 2.8275 2.3368 1.6522 1.6792 2.2317 1.9903 1.8651 2.0354 1.3294 1.0452 1.3195 1.0499 1.0415 1.6541 1.1224 1.1061 1.0810 2.5417 3.0742 6.5363 4.5813 6.3148 1.0385 1.0326 1.1005 1.0361 1.1039 1.0946 1.1002 1.0980 1.0997 1.0904 1.0898 1.0944 1.0764 1.0773
irintensity: 1.7614 8.8674 4.4169 9.2282 2.0356 4.7230 0.0154 5.5579 0.0848 1.3187 0.0433 1.0459 0.2300 1.6491 2.3954 1.2269 57.7764 55.7569 14.7349 7.0013 19.0217 10.9787 52.0931 0.5904 6.2024 4.1468 13.1850 0.3424 17.4125 94.8614 5.3200 6.2795 6.0274 36.1348 23.9017 14.5157 7.6882 0.1270 2.0091 51.1676 0.9673 41.8633 169.0524 17.7770 49.0551 60.2817 6.3746 234.3294 43.5732 55.6435 19.4756 14.6145 16.1580 10.7356 14.1613 28.1178 18.5049 11.1323 98.3221 426.7287 47.2520 65.1370 186.0987 181.2838 110.0073 73.4781 61.8435 18.4297 49.2380 27.6153 22.5974 9.0911 26.4919 17.4156 13.4488 7.9287 9.3363 67.4163
temp: 298.150 k
press: 1.00000 atm
elementType: 8 8 7 7 6 6 6 6 6 6 6 6 6 6 1 1 1 1 1 1 1 1 1 1 1 1 1 1
symmnumber: 1
zpe: 598707.9 jmol-1
zpe.correction: 0.228036 hartree
zpe.thermalcorrener: 0.242957 hartree
zpe.thermalcorrenthalpy: 0.243902 hartree
zpe.thermalcorrgfe: 0.185708 hartree
zpe.sumelectzpe: -648.361606 hartree
zpe.sumelectthermal: -648.346684 hartree
zpe.sumelectthermalent: -648.345740 hartree
zpe.sumelectthermalfe: -648.403934 hartree
dipole: 2.6455 3.5752 0.0224
dipole: 4.4476
quadrupole: -72.2379 -71.6561 -87.7052
quadrupole: -15.9696 -0.0028 -0.0183
quadrupole: 4.9618 5.5436 -10.5054 -15.9696 -0.0028 -0.0183
hfenergy: -648.5896416 hartree
pointgroup: C01 [X(C10H14N2O2)]
dipole: 1.0777956 1.3715248 -0.1381323 debye
polarizability: 206.5249245|1.6688997|146.8395393|2.2143542|-9.3194815|70.1601803 unknown
InChI: InChI=1S/C10H14N2O2/c1-7(13)12-8-4-5-10(14-3)9(6-8)11-2/h4-6,11-12H,1-3H3
charge 0 multiplicity 1
28 atoms
O  3.207079 -0.817675 0.357851
O  -3.488445 -1.271432 0.294195
N  2.554133 1.737804 0.039031
N  -2.235421 0.706229 0.082127
C  1.502384 0.833166 0.129523
C  -0.890229 0.226424 0.161518
C  1.816602 -0.55777 0.301541
C  0.139013 1.205079 0.061918
C  -0.567989 -1.138969 0.329488
C  0.797333 -1.515703 0.397988
C  2.37159 3.170679 -0.138265
C  -3.426327 -0.013283 0.146683
C  3.617453 -2.20768 0.542049
C  -4.691664 0.838068 0.02444
H  -0.124307 2.261311 -0.069575
H  -1.365012 -1.878718 0.403587
H  1.041551 -2.574477 0.529068
H  3.490756 1.34238 0.102635
H  -2.328016 1.716808 -0.037741
H  1.802097 3.625418 0.699784
H  1.834048 3.409298 -1.080418
H  3.357774 3.661736 -0.180126
H  -5.311205 0.687875 0.925491
H  -5.280125 0.481079 -0.838493
H  -4.50057 1.918819 -0.098996
H  3.268106 -2.842019 -0.295868
H  3.232736 -2.614287 1.497704
H  4.717456 -2.19006 0.56146
