program: Gaussian 09
title: 000106180
version: EM64L-G09RevD.01
frameworkgroup: C1[X(C3H4BrCl)]
method: RPBEPBE
basis: SDD
operation: Freq
keyword: #p
keyword: freq=noraman
keyword: PBEPBE/SDD
title: #p freq=noraman PBEPBE/SDD
converged: NO NO NO NO
title: Mulliken charges:
elementType: Br Cl C C C H H H H
charge: 0.076680 0.000448 -0.701490 0.050467 -0.384876 0.241972 0.238366 0.238367 0.240066
chargesum: 0.00000
title: Mulliken charges with hydrogens summed into heavy atoms:
elementType: Br Cl C C C
charge: 0.076680 0.000448 0.017215 0.290533 -0.384876
polarizability: 8.11282043e+01 3.54872818e+00 6.03057646e+01 -6.16111547e-04 -2.23475137e-04 2.53239389e+01
1716.lowfreq: -8.8452 -0.0020 -0.0006 0.0015 5.0632 5.8718 113.2885 193.8006 198.3933
frequency: 113.1756 193.7992 198.3911 226.4425 340.9840 431.1498 535.4003 767.9085 812.1387 962.6550 1035.3272 1103.9639 1268.6738 1393.4390 1461.6237 1466.0239 1648.6288 2979.2011 3054.5557 3109.0012 3132.8643
redmass: 1.0322 2.9639 4.2766 21.4643 5.5457 5.2322 5.1420 5.2880 1.1402 1.9338 1.4723 2.4661 1.2055 1.2183 1.0656 1.0461 7.2756 1.0376 1.0975 1.0964 1.0914
irintensity: 0.2517 2.4096 0.6965 0.0797 7.5572 4.6324 7.5410 162.6873 30.5621 38.1448 0.2488 18.2649 18.4368 8.3789 14.1529 16.4791 27.8073 22.8137 17.6974 6.6410 9.5637
temp: 298.150 k
press: 1.00000 atm
elementType: 35 17 6 6 6 1 1 1 1
symmnumber: 1
zpe: 156922.2 jmol-1
zpe.correction: 0.059769 hartree
zpe.thermalcorrener: 0.066113 hartree
zpe.thermalcorrenthalpy: 0.067057 hartree
zpe.thermalcorrgfe: 0.027908 hartree
zpe.sumelectzpe: -589.813869 hartree
zpe.sumelectthermal: -589.807525 hartree
zpe.sumelectthermalent: -589.806580 hartree
zpe.sumelectthermalfe: -589.845729 hartree
dipole: -1.5751 -1.8110 0.0000
dipole: 2.4001
quadrupole: -41.3121 -44.1766 -47.7352
quadrupole: 2.4233 -0.0002 -0.0001
quadrupole: 3.0959 0.2313 -3.3272 2.4233 -0.0002 -0.0001
hfenergy: -589.8736373 hartree
pointgroup: C01 [X(C3H4Br1Cl1)]
dipole: 0.8279365 -0.4540578 0.0000039 debye
dipolederiv: -0.5868379 -0.2295705 0.0000178 -0.2799094 -0.2370602 0.0000075 0.0001155 0.0000162 0.0335807 -0.2129227 -0.0979984 0.000005 -0.0605052 -0.7985154 -0.0000173 0.000035 -0.0000268 0.0030517 -0.140374 -0.0544943 0.0000037 0.0996955 0.0034676 -0.0000088 0.0000999 0.0000036 0.095963 -0.1208991 -0.0334492 0.0000284 0.0425915 -0.2466401 -0.0000143 0.0000118 -0.0000134 -0.1496774 0.9626569 0.3188051 -0.0000527 0.3631973 1.224707 0.000025 -0.0001832 0.0000169 -0.2083311 0.1036909 0.0402346 -0.0000016 -0.0702156 -0.0861001 0.0000066 -0.0000004 -0.0000005 0.119907 -0.0265906 0.0291192 -0.0776496 -0.0107992 0.0979018 0.0816921 -0.1146832 0.0741346 -0.031081 -0.0265529 0.0291212 0.0776515 -0.010769 0.097902 -0.0816911 0.1145922 -0.07414 -0.0310795 0.0478295 -0.0017677 -0.0000023 -0.073286 -0.0556627 0.0000004 0.0000123 0.0000095 0.1676665 unknown
polarizability: 80.9392759|4.0610007|60.4946929|-0.0006554|-0.0000035|25.3239389 unknown
InChI: InChI=1S/C3H4BrCl/c1-2-3(4)5/h2H,1H3
charge 0 multiplicity 1
9 atoms
Br -2.167174 -0.814157 0.000054
Cl -0.391958 1.803125 0.000021
C  2.162118 -0.221702 -0.000061
C  0.747899 -0.749217 -0.000053
C  -0.384177 -0.010477 -0.00004
H  2.193753 0.879061 -0.000065
H  2.70729 -0.588883 0.890263
H  2.707284 -0.588899 -0.890379
H  0.617865 -1.839051 -0.000041
