program: Gaussian 09
title: 000106170
version: EM64L-G09RevD.01
frameworkgroup: C1[X(C19H16N4O5S)]
method: RPBEPBE
basis: SDD
operation: Freq
keyword: #p
keyword: freq=noraman
keyword: PBEPBE/SDD
title: #p freq=noraman PBEPBE/SDD
converged: YES YES NO NO
title: Mulliken charges:
elementType: S O O O O O N N N N C C C C C C C C C C C C C C C C C C C H H H H H H H H H H H H H H H H
charge: 0.994910 -0.568087 -0.501196 -0.504395 -0.167785 -0.324108 -0.419495 -0.395373 0.043619 0.034335 -0.088795 0.494416 -0.194231 -0.194255 -0.398596 -0.330276 0.444463 0.093010 0.449926 -0.101191 -0.052560 -0.396579 -0.352759 -0.389615 -0.321392 -0.265850 0.171342 -0.286412 -0.804008 0.284085 0.284865 0.237377 0.315264 0.292617 0.240015 0.294828 0.236052 0.237161 0.204277 0.364370 0.259687 0.226087 0.234978 0.236323 0.382949
chargesum: 0.00000
title: Mulliken charges with hydrogens summed into heavy atoms:
elementType: S O O O O O N N N N C C C C C C C C C C C C C C C C C C C
charge: 0.994910 -0.185138 -0.501196 -0.504395 -0.167785 -0.324108 -0.126878 -0.031003 0.043619 0.034335 -0.088795 0.494416 0.089854 0.090609 -0.161219 -0.015012 0.444463 0.093010 0.449926 -0.101191 -0.052560 -0.156565 -0.057930 -0.153563 -0.084231 -0.061574 0.171342 -0.026725 -0.106619
polarizability: 8.17178779e+02 2.55740364e+01 3.24166783e+02 -1.29695634e+00 2.69103384e-01 1.27815081e+02
1716.lowfreq: -5.5198 -0.0017 -0.0016 0.0014 1.2699 1.7377 10.4643 18.9940 23.7464
frequency: 10.2197 18.9522 23.7426 25.0597 29.6604 44.0066 52.7929 57.0488 61.0811 89.4991 110.7177 120.0600 132.9637 149.3357 168.3567 182.0473 198.7200 205.4983 227.4844 242.1150 252.8415 276.9500 287.1463 303.9012 315.0123 338.5358 362.1966 364.4974 371.6480 388.4408 407.9257 413.9944 415.1603 421.8283 459.0277 460.9695 465.0447 501.1186 513.1078 521.8476 544.4372 555.5529 560.4545 614.1197 625.8788 634.9324 660.1668 677.2774 680.4888 702.5348 718.1355 730.6455 763.1665 795.1236 814.9762 821.7778 827.7602 831.3689 831.8175 849.1700 852.0760 858.9618 863.3372 939.9414 954.0100 959.6042 963.1611 967.0324 985.4773 987.5145 993.4917 1001.2377 1006.2327 1006.3530 1044.6659 1046.7956 1056.6210 1077.5802 1117.6965 1123.8395 1157.6750 1166.7421 1175.8088 1180.5742 1214.3190 1223.8021 1249.1228 1278.6971 1287.9794 1296.2764 1312.0944 1317.6121 1366.2066 1381.6285 1385.8991 1396.6130 1400.1142 1417.1388 1421.6929 1443.0028 1468.6573 1470.3646 1475.3017 1484.2991 1505.2667 1520.9929 1545.6259 1582.7985 1587.4934 1598.6629 1603.0855 1608.9717 1619.5241 2978.1735 2985.0852 3055.5351 3088.3782 3093.1961 3126.2770 3131.4580 3132.7510 3148.8834 3164.0091 3164.2456 3169.9882 3176.5144 3189.4796 3384.2465 3479.7144
redmass: 7.9257 4.8602 6.3378 1.2511 4.7352 4.3077 4.0758 5.2205 6.4342 7.0625 5.9472 8.5281 9.6858 6.4173 1.6211 6.7245 4.5547 6.9463 4.7346 5.6727 4.9122 5.3020 4.7765 6.0602 4.9087 2.9758 9.4703 4.4934 5.0439 5.7238 2.9126 10.4775 3.0098 11.4726 8.2824 7.7414 6.6904 2.8580 5.0744 3.9695 3.6140 5.7843 5.8146 6.9071 6.8436 6.9049 4.0457 6.0693 1.5980 6.8538 3.0566 3.5105 4.8621 6.9845 1.9953 1.7230 1.4395 3.8114 8.6377 4.6331 1.3080 4.4038 1.4852 6.5560 1.3443 1.3342 1.6014 5.9631 4.6630 1.4225 1.3344 1.3479 2.6468 1.2113 1.3803 1.5592 1.8900 2.8874 1.3502 1.3158 2.1206 2.8231 1.1328 1.3627 2.7203 3.1899 2.6523 2.2462 2.7091 1.7010 1.3395 2.6950 4.6298 4.5442 5.4113 2.6445 1.2870 4.4253 3.5580 7.2082 1.0472 2.4180 1.1562 3.4529 2.7211 2.4850 2.4178 8.8040 6.5710 5.9665 4.8008 4.2854 6.2081 1.0376 1.0842 1.0972 1.0988 1.0881 1.0878 1.0905 1.0902 1.0971 1.0908 1.0951 1.0957 1.0951 1.0962 1.0739 1.0661
irintensity: 1.5995 0.5835 0.1470 2.0564 3.1851 0.1852 1.5112 0.1992 1.9583 1.8115 0.3027 0.6379 0.2075 0.0965 52.4138 6.3787 10.9770 1.4509 4.7025 10.7236 1.9523 77.2570 40.6256 12.6647 0.1845 4.9201 5.4146 4.3828 0.7822 15.2740 0.0097 17.5046 0.9773 66.5547 23.3916 13.2120 68.1581 18.1592 0.4075 63.2351 61.6598 5.2107 179.8253 33.0496 23.3605 2.1270 9.2116 0.5086 59.3453 56.4327 0.9580 0.6945 7.7018 18.6375 23.5262 34.0041 66.6507 12.3383 123.5381 12.5171 22.0593 12.8646 46.7973 317.1256 0.0142 0.2287 20.6479 82.8409 3.2601 10.5701 5.3745 1.2060 12.3060 94.8949 41.5302 12.6313 160.4242 120.1847 17.4366 9.7456 198.3135 6.9486 20.7770 7.4704 37.6225 3.1778 271.1110 91.6418 23.5131 15.0431 13.8910 70.7825 358.7350 11.7311 377.1599 143.1812 1.2291 7.7529 139.8157 1239.1091 13.5373 6.3495 15.2313 40.8125 10.4755 343.7426 287.3159 107.8734 107.5245 269.0974 23.2962 41.2102 52.6931 42.3443 38.2658 18.1411 23.0342 11.3331 14.8749 21.8613 8.7624 24.0434 1.8962 15.8901 4.8710 2.4374 1.2676 5.5509 47.5159
temp: 298.150 k
press: 1.00000 atm
elementType: 16 8 8 8 8 8 7 7 7 7 6 6 6 6 6 6 6 6 6 6 6 6 6 6 6 6 6 6 6 1 1 1 1 1 1 1 1 1 1 1 1 1 1 1 1
symmnumber: 1
zpe: 841261.6 jmol-1
zpe.correction: 0.320420 hartree
zpe.thermalcorrener: 0.347732 hartree
zpe.thermalcorrenthalpy: 0.348676 hartree
zpe.thermalcorrgfe: 0.257682 hartree
zpe.sumelectzpe: -1724.522248 hartree
zpe.sumelectthermal: -1724.494936 hartree
zpe.sumelectthermalent: -1724.493991 hartree
zpe.sumelectthermalfe: -1724.584985 hartree
dipole: -5.3135 4.5591 1.3234
dipole: 7.1253
quadrupole: -170.8133 -160.6630 -182.5823
quadrupole: 29.1387 15.4163 -4.5022
quadrupole: 0.5396 10.6899 -11.2295 29.1387 15.4163 -4.5022
hfenergy: -1724.8426675 hartree
pointgroup: C01[X(C19H16N4O5S1)]
dipole: -1.9941267 -1.9102385 -0.4826819 debye
polarizability: 818.4528076|1.5173552|322.8375168|-5.6778897|-1.510917|127.8703182 unknown
InChI: InChI=1S/C19H16N4O5S/c1-12-2-4-13(5-3-12)21-23-18-17(24)11-10-16(19(18)25)22-20-14-6-8-15(9-7-14)29(26,27)28/h2-11,20-21,26H,1H3
charge 0 multiplicity 1
45 atoms
S  7.883615 1.720308 -0.038826
O  8.075573 1.821366 -1.887117
O  7.669174 3.21898 0.532224
O  9.058687 0.773091 0.546244
O  -0.79489 0.855029 -0.099221
O  -3.489126 -3.175005 -0.046571
N  2.656767 -1.31338 -0.058283
N  -4.533337 -0.811571 -0.04056
N  1.478442 -0.655411 -0.070909
N  -3.312924 -0.274619 -0.054418
C  6.269224 0.794912 -0.05956
C  3.866936 -0.584168 -0.059477
C  6.313707 -0.609089 -0.035505
C  5.073557 1.536047 -0.08437
C  5.091076 -1.304861 -0.032081
C  3.854127 0.837211 -0.080221
C  -5.681026 0.019243 -0.025545
C  0.309898 -1.313082 -0.071735
C  -8.036509 1.612581 0.007763
C  -2.230914 -1.103512 -0.063074
C  -0.90803 -0.404987 -0.079945
C  -6.954514 -0.601585 -0.009243
C  -5.572545 1.434319 -0.025313
C  -8.116902 0.196571 0.007478
C  -6.743809 2.209798 -0.008593
C  0.143125 -2.759754 -0.065605
C  -2.334972 -2.568663 -0.055916
C  -1.096532 -3.354147 -0.059355
C  -9.285642 2.473691 0.021836
H  7.271511 -1.136918 -0.003897
H  5.097968 2.630022 -0.090368
H  5.091408 -2.401054 -0.010677
H  2.894473 1.358868 -0.095786
H  2.722523 -2.341994 -0.045667
H  -7.033775 -1.695298 -0.00878
H  -4.578845 1.890284 -0.037493
H  -9.099644 -0.288285 0.020868
H  -6.659692 3.303226 -0.007704
H  1.022862 -3.418488 -0.068356
H  -4.594764 -1.86631 -0.038972
H  -1.216486 -4.442463 -0.056421
H  -10.201384 1.861311 0.07929
H  -9.286041 3.165955 0.884533
H  -9.352927 3.096162 -0.890581
H  8.903674 2.352868 -2.074392
