program: Gaussian 09
title: 000008510
version: EM64L-G09RevD.01
frameworkgroup: C1[X(C14H6ClNO4)]
method: RPBEPBE
basis: SDD
operation: Freq
keyword: #p
keyword: freq=noraman
keyword: PBEPBE/SDD
title: #p freq=noraman PBEPBE/SDD
converged: NO YES NO NO
title: Mulliken charges:
elementType: Cl O O O O N C C C C C C C C C C C C C C H H H H H H
charge: 0.028488 -0.173772 -0.163046 -0.160249 -0.160228 0.002554 0.098390 0.288062 0.277539 0.378827 -0.169847 -0.164168 0.310521 -0.393001 -0.381104 -0.296836 -0.319266 -0.211880 -0.218865 -0.224439 0.301663 0.303178 0.269216 0.254625 0.253126 0.270512
chargesum: 0.00000
title: Mulliken charges with hydrogens summed into heavy atoms:
elementType: Cl O O O O N C C C C C C C C C C C C C C
charge: 0.028488 -0.173772 -0.163046 -0.160249 -0.160228 0.002554 0.098390 0.288062 0.277539 0.378827 -0.169847 -0.164168 0.310521 -0.091339 -0.077926 -0.296836 -0.050050 0.042745 0.034261 0.046073
polarizability: 2.77714862e+02 -7.05121101e+00 2.19916753e+02 -7.21344622e-03 -2.06209511e-02 8.21917908e+01
1716.lowfreq: -5.8223 0.0017 0.0023 0.0026 5.1850 9.0284 14.7627 39.5284 46.1274
frequency: 14.0808 39.4927 46.0768 95.4309 129.6822 150.5428 160.5922 176.8401 188.2587 235.1618 288.5478 305.3344 322.9732 353.4815 358.5369 383.9676 390.4309 413.7893 457.1762 476.9963 479.6029 510.2309 578.6342 598.6803 656.4274 661.6248 667.2741 688.3608 707.1469 732.3598 763.0029 790.2881 796.6096 824.6154 828.1597 866.9046 908.9858 947.0637 949.9851 970.8744 1008.7825 1011.3128 1064.7168 1079.4000 1116.4342 1140.0829 1168.6590 1182.7830 1191.4888 1212.6960 1250.1794 1278.1323 1298.1624 1375.7905 1387.8120 1396.4750 1417.3867 1430.4738 1442.4014 1446.2510 1536.4939 1548.1380 1563.2633 1585.0881 1594.3499 1609.7143 3152.6920 3153.2699 3167.8458 3169.2102 3179.7548 3180.5578
redmass: 14.7139 9.7549 9.2606 11.7140 11.3401 6.1846 7.6635 15.8359 4.6494 5.8835 8.5982 12.5575 7.7634 6.5844 8.9133 9.8787 9.7668 5.1717 9.9328 3.6904 11.5248 5.3297 5.2239 7.6450 9.4213 4.6412 9.3798 7.5644 3.0611 9.6317 7.3358 7.7711 1.4251 1.5564 9.2365 4.6729 6.6555 1.3876 1.4395 8.3469 1.3710 1.3656 2.4264 2.1106 3.5981 3.5666 1.3877 1.8535 1.4127 1.7633 5.9137 3.7886 3.2481 10.8725 14.6432 11.1366 3.1749 2.4989 2.6098 3.4143 10.1752 8.4443 7.0597 6.8201 8.0440 8.3268 1.0877 1.0878 1.0927 1.0927 1.0997 1.0997
irintensity: 0.2370 5.1549 4.4925 0.0041 2.7471 0.1011 0.2326 0.3422 0.0620 0.2053 5.7170 1.8804 1.0333 0.0003 2.7326 26.1236 6.5390 0.0141 0.0043 0.7526 0.8138 3.9538 3.9341 2.7213 18.4602 1.2580 40.2894 0.9808 45.5318 12.7641 8.7369 28.1046 0.2455 80.6764 6.8411 0.6172 2.1548 1.3578 0.0072 37.8866 1.1056 2.0788 0.2950 4.8712 54.3440 4.9479 14.9657 1.9494 0.9420 28.3936 168.3829 234.7439 291.9578 1.9941 168.6101 1.8716 35.8758 2.6771 6.1859 28.5769 13.6048 224.0293 33.4618 1.1502 0.7886 16.2850 4.5227 2.1217 0.4071 0.4194 11.5708 5.7786
temp: 298.150 k
press: 1.00000 atm
elementType: 17 8 8 8 8 7 6 6 6 6 6 6 6 6 6 6 6 6 6 6 1 1 1 1 1 1
symmnumber: 1
zpe: 438156.4 jmol-1
zpe.correction: 0.166885 hartree
zpe.thermalcorrener: 0.182586 hartree
zpe.thermalcorrenthalpy: 0.183530 hartree
zpe.thermalcorrgfe: 0.121659 hartree
zpe.sumelectzpe: -1351.354119 hartree
zpe.sumelectthermal: -1351.338418 hartree
zpe.sumelectthermalent: -1351.337474 hartree
zpe.sumelectthermalfe: -1351.399344 hartree
dipole: 2.4519 1.5285 -0.0039
dipole: 2.8894
quadrupole: -120.8848 -113.4659 -124.6324
quadrupole: -33.7443 0.0048 -0.0062
quadrupole: -1.2237 6.1951 -4.9714 -33.7443 0.0048 -0.0062
hfenergy: -1351.5210036 hartree
pointgroup: C01 [X(C14H6Cl1N1O4)]
dipole: -0.8883423 -0.709288 -0.0015203 debye
dipolederiv: -0.4370973 -0.2924042 -0.0001363 -0.4639811 -0.3667179 -0.0002175 -0.0002967 -0.0002104 -0.0169133 -0.8156838 -0.1059464 -0.0000978 -0.0178237 -0.725729 -0.0003056 -0.0000389 -0.0002264 -0.2459513 -0.6201592 -0.0707276 0.0002673 0.0326227 -0.7820563 0.0004751 0.0002333 0.0001551 -0.2785417 -0.4825197 -0.1876704 0.1441429 -0.2311804 -0.3901535 0.1402929 0.1421338 0.0228728 -0.6839093 -0.4827351 -0.1875878 -0.1444566 -0.2311792 -0.3900132 -0.1399728 -0.1423518 -0.0225324 -0.6838453 0.8022656 0.4196712 0.0003322 0.4140968 0.6250285 -0.0003293 0.0001176 -0.0003582 1.2515599 -0.2653599 0.2495097 0.0000844 0.5304632 -0.43799 -0.0003025 0.0000957 -0.000183 0.0178337 -0.6079425 0.0278717 0.0001059 -0.1399535 0.0467885 0.0000487 0.0001035 0.0000843 0.0559028 -0.7586223 0.0519418 -0.0001677 -0.1174308 0.125358 -0.0000699 -0.0001377 -0.0000202 0.0067832 -0.4733521 0.1891618 -0.00006 0.4699605 -0.5509662 0.0000228 0.0000794 -0.0000843 0.0557849 1.6360049 -0.2197364 0.000144 -0.3955775 0.9271804 0.00053 0.0000719 0.0003263 0.145525 1.569908 -0.2025516 -0.000395 -0.5336252 0.9666567 -0.0005845 -0.0004066 -0.0001329 0.131229 0.1221902 -0.0723945 -0.0000293 0.1909311 0.2047586 0.0000508 0.0000902 0.0000767 -0.030302 -0.216407 0.1774309 0.0000607 0.0417264 0.0269581 0.0000179 0.0001408 -0.0000977 -0.1017553 -0.2101346 0.2123573 -0.0000314 0.0424559 -0.0239421 0.0000315 -0.0000698 0.0000815 -0.0968465 0.5028689 0.2924417 0.0002586 0.9304798 0.6918195 0.0004097 0.0003 0.0003252 -0.0506941 0.0799734 -0.0146637 -0.0000773 -0.1278482 -0.2056365 0.0000062 -0.0000806 -0.0000209 -0.0888767 0.1407406 -0.0891969 -0.0001074 -0.0915524 0.1475088 0.0001376 -0.0001231 0.00014 -0.1169084 0.197692 -0.120236 0.0001034 -0.075046 0.1399994 0.0000213 0.0000824 0.0000071 -0.1226198 0.0558587 -0.0419332 0.0000694 -0.2878947 -0.3020325 -0.0001181 0.0000448 -0.0000603 -0.0828818 0.1257318 -0.0828372 -0.0000155 -0.0162678 0.0607441 -0.0000389 -0.0000192 0.0000267 0.1553175 0.1173245 -0.0804968 -0.0000197 -0.0231786 0.0631863 0.0000011 0.0000479 -0.0000331 0.1560256 -0.0132707 0.0006485 0.0000508 -0.0346038 0.098827 -0.0000064 0.0000379 -0.0000281 0.1515462 0.0312144 0.0714908 0.0000657 0.0760433 -0.0216312 -0.0000874 0.0000667 -0.0000975 0.1565949 0.0282478 0.0700939 -0.0000244 0.0822521 -0.0296284 -0.0000005 -0.0000443 0.0000132 0.1576235 -0.0267366 0.0057634 -0.0000665 -0.0238889 0.101683 -0.0000124 -0.0000772 -0.0000238 0.1583194 unknown
polarizability: 278.5619994|-0.1975218|219.0696162|0.0047711|0.0213189|82.1917908 unknown
InChI: InChI=1S/C14H6ClNO4/c15-9-5-1-3-7-11(9)13(17)8-4-2-6-10(16(19)20)12(8)14(7)18/h1-6H
charge 0 multiplicity 1
26 atoms
Cl -4.334041 -1.722637 -0.001247
O  0.844934 2.271618 0.001008
O  -1.595825 -2.665122 0.000808
O  3.630329 1.638707 -1.144941
O  3.630961 1.637912 1.144342
N  3.276806 1.172249 -0.000366
C  1.07868 -0.119286 -0.000193
C  0.426654 -1.384575 -0.00034
C  -1.21591 1.020639 0.000112
C  -1.886341 -0.249715 -0.000105
C  0.278191 1.13542 0.000301
C  -1.075561 -1.509127 0.000391
C  2.496812 -0.100842 -0.000592
C  1.184836 -2.579982 -0.000962
C  -1.941886 2.233515 0.000022
C  -3.311177 -0.227453 -0.000624
C  3.258022 -1.283641 -0.001274
C  2.592203 -2.530074 -0.001466
C  -3.349098 2.217393 -0.000397
C  -4.034424 0.985154 -0.000769
H  0.643566 -3.530416 -0.000972
H  -1.376419 3.169785 0.000244
H  4.350945 -1.229298 -0.00163
H  3.177731 -3.454381 -0.001991
H  -3.916839 3.152828 -0.000486
H  -5.127647 0.95273 -0.001175
