program: Gaussian 09
title: 000105842
version: EM64L-G09RevD.01
frameworkgroup: C1[X(C4H11Cl2NSi)]
method: RPBEPBE
basis: SDD
operation: Freq
keyword: #p
keyword: freq=noraman
keyword: PBEPBE/SDD
title: #p freq=noraman PBEPBE/SDD
converged: YES YES NO NO
title: Mulliken charges:
elementType: Cl Cl Si N C C C C H H H H H H H H H H H
charge: -0.292975 -0.299111 1.031654 -0.517690 -0.778319 -0.640650 -0.578579 -0.553458 0.257734 0.282909 0.230300 0.238869 0.227298 0.231046 0.228987 0.234969 0.243008 0.225494 0.228515
chargesum: 0.00000
title: Mulliken charges with hydrogens summed into heavy atoms:
elementType: Cl Cl Si N C C C C
charge: -0.292975 -0.299111 1.031654 -0.517690 -0.237677 0.055817 0.116423 0.143559
polarizability: 9.40294209e+01 9.69170570e-01 9.01272329e+01 1.39928974e+00 2.07369912e+00 8.92234951e+01
1716.lowfreq: -0.0026 -0.0024 -0.0022 7.0387 10.2700 15.4248 47.6322 79.6660 95.5828
frequency: 47.2099 79.6328 95.5622 100.3429 141.9469 162.4265 164.2563 180.7396 187.0003 243.7314 276.9749 304.5084 306.3031 371.3298 437.1416 489.4867 626.5422 720.9517 753.1416 986.9051 994.9467 1006.3642 1034.9196 1066.2939 1086.2474 1135.5206 1173.2883 1235.3153 1268.4575 1286.2246 1401.8177 1424.9395 1435.8091 1451.3789 1461.9013 1473.7199 1477.7153 1482.1504 1486.4082 1499.9335 2942.8596 2949.4538 2987.2806 3003.6607 3015.5140 3024.3004 3057.5247 3079.0590 3081.3332 3090.7446 3092.5050
redmass: 2.8976 2.8013 3.5133 3.7010 2.8193 2.8442 3.0087 1.0451 1.3406 1.6286 3.5949 3.6289 5.0545 2.8693 4.8716 13.2719 3.9009 3.7993 1.4599 2.0500 1.4321 1.6172 2.1537 1.4021 1.2142 1.3703 5.2167 1.2273 1.3849 2.3824 1.1764 1.1117 1.0940 1.1424 1.0429 1.0449 1.0402 1.0483 1.0461 1.0581 1.0362 1.0366 1.0353 1.0603 1.1003 1.1009 1.0993 1.0974 1.0998 1.1003 1.0978
irintensity: 0.5329 0.8522 1.5728 0.3718 1.3628 3.1167 7.7118 0.2600 1.6989 1.5973 8.2009 4.8043 3.8652 4.8441 36.9683 155.7912 37.4770 46.5303 54.5525 109.6721 12.9357 49.2474 26.2553 11.3525 0.2120 0.1435 61.3575 4.0533 3.5724 33.0614 14.7655 2.6825 17.4489 0.4784 1.1825 20.7718 9.8414 34.6114 11.0381 5.2450 63.9635 104.4713 30.8046 6.7777 57.9143 22.2376 0.2840 45.4976 14.8365 24.5819 12.7419
temp: 298.150 k
press: 1.00000 atm
elementType: 17 17 14 7 6 6 6 6 1 1 1 1 1 1 1 1 1 1 1
symmnumber: 1
zpe: 394072.2 jmol-1
zpe.correction: 0.150094 hartree
zpe.thermalcorrener: 0.162388 hartree
zpe.thermalcorrenthalpy: 0.163332 hartree
zpe.thermalcorrgfe: 0.110880 hartree
zpe.sumelectzpe: -1422.703887 hartree
zpe.sumelectthermal: -1422.691593 hartree
zpe.sumelectthermalent: -1422.690649 hartree
zpe.sumelectthermalfe: -1422.743101 hartree
dipole: 4.1922 1.4916 -0.8195
dipole: 4.5245
quadrupole: -71.8402 -68.4686 -75.2890
quadrupole: -4.1223 -0.7436 -4.9036
quadrupole: 0.0258 3.3973 -3.4231 -4.1223 -0.7436 -4.9036
hfenergy: -1422.8539811 hartree
pointgroup: C01 [X(C4H11Cl2N1Si1)]
dipole: 0.3012182 1.7444218 -0.1868591 debye
dipolederiv: -0.4199349 -0.0158303 0.0833642 -0.0554773 -0.4556221 0.1713617 0.0672396 0.1764444 -0.7132375 -0.4301779 0.0665167 0.0372113 -0.0251591 -0.7710437 -0.2974558 -0.0092387 -0.3375854 -0.6549018 1.6085252 0.1819903 -0.1047721 0.257641 1.8050207 0.1394233 -0.0198532 0.1736223 1.7370924 -1.0677409 -0.1417397 -0.0944866 -0.123299 -0.9135099 0.1218759 -0.0836345 0.1425169 -0.7117789 -0.2170077 -0.0618346 -0.0020891 0.0241027 -0.2755239 -0.0404024 0.0315856 -0.0845725 -0.2691767 -0.0121206 0.1126544 0.0547411 0.0279821 0.0059393 -0.0451998 -0.0777912 0.081505 0.0345285 0.1918716 0.0786688 -0.093985 0.2080599 0.4656076 -0.0636131 -0.225691 -0.1900118 0.244279 0.498207 -0.0159262 0.1177871 -0.2254357 0.0923389 0.039381 0.193258 0.1097794 0.2836283 0.0980648 0.0384926 0.0212744 0.018152 0.0181894 0.0861832 0.0648299 0.0369252 -0.0845914 -0.0291853 -0.0932889 -0.0201841 -0.0461756 0.0156943 -0.0428841 -0.0063019 -0.0448358 0.093491 -0.0936334 0.139821 -0.048288 0.1479144 -0.0171977 0.0027266 -0.0560468 0.0015805 0.0612981 0.1106605 -0.0150197 0.0348079 -0.0494983 0.0688115 0.0870099 0.0659317 0.0317678 -0.080563 -0.0237703 -0.1546431 -0.0209287 -0.1125523 -0.0174494 -0.0371558 -0.0114255 -0.0233891 0.0814546 0.0436661 -0.1268078 -0.0120712 -0.1013144 -0.119289 -0.0644357 -0.0432913 -0.1136367 -0.0155889 -0.0600204 0.0917287 -0.1050335 0.0474958 0.0640393 0.0357861 -0.0911295 0.0588684 0.0373421 -0.0928638 -0.0618994 0.1690588 0.0285018 0.0157388 -0.0213673 0.1599281 0.0531345 -0.0504516 0.1077134 -0.0505251 0.0445388 0.0042404 -0.0117646 0.1032559 0.0018788 0.0820392 0.0456366 -0.031188 -0.0298866 -0.0875909 -0.0903159 -0.0516495 -0.1498989 -0.0993521 -0.1051208 -0.0118577 -0.1810653 0.057529 0.0266457 0.0651376 0.0816702 -0.0245906 0.1391039 -0.0490313 -0.0266029 unknown
polarizability: 90.0676482|1.5661217|93.4183578|-1.0100657|2.5103338|89.8941429 unknown
InChI: InChI=1S/C4H11Cl2NSi/c1-4-8(5,6)7(2)3/h4H2,1-3H3
charge 0 multiplicity 1
19 atoms
Cl -0.752987 -1.584078 1.783964
Cl 0.015053 -2.185937 -1.578728
Si -0.279908 -0.544198 -0.099195
N  1.161791 0.399245 0.177832
C  -1.784035 0.457626 -0.665297
C  -2.189924 1.580078 0.322054
C  1.459959 1.607041 -0.6205
C  2.31663 -0.098851 0.952669
H  -1.578113 0.865508 -1.673659
H  -2.613939 -0.262606 -0.791913
H  -3.084204 2.111646 -0.050038
H  -2.431364 1.167763 1.3178
H  -1.384181 2.324209 0.455248
H  1.816026 2.418081 0.045479
H  0.560735 1.972316 -1.145981
H  2.246584 1.412724 -1.379145
H  2.024732 -0.965197 1.56911
H  2.681681 0.695556 1.633176
H  3.152767 -0.403226 0.289924
