program: Gaussian 09
title: 000008492
version: EM64L-G09RevD.01
frameworkgroup: C1[X(C6H5ClN2O2)]
method: RPBEPBE
basis: SDD
operation: Freq
keyword: #p
keyword: freq=noraman
keyword: PBEPBE/SDD
title: #p freq=noraman PBEPBE/SDD
converged: YES YES NO YES
title: Mulliken charges:
elementType: Cl O O N N C C C C C C H H H H H
charge: -0.046281 -0.223624 -0.222422 0.016759 -0.662373 0.411906 0.620371 -0.387670 -0.365336 -0.283318 -0.343640 0.308734 0.287931 0.235408 0.329936 0.323619
chargesum: 0.00000
title: Mulliken charges with hydrogens summed into heavy atoms:
elementType: Cl O O N N C C C C C C
charge: -0.046281 -0.223624 -0.222422 0.016759 -0.008818 0.411906 0.620371 -0.078936 -0.077404 -0.283318 -0.108232
polarizability: 1.71005019e+02 8.52119782e+00 1.12540291e+02 3.89098076e-03 1.67996498e-03 3.63209904e+01
1716.lowfreq: -8.0315 -2.6457 -0.0026 -0.0022 -0.0011 5.4829 66.2180 108.7890 169.2557
frequency: 66.2178 108.7888 169.2555 170.9006 260.3566 307.6368 337.5313 354.1505 428.5099 454.3051 459.7631 516.3406 529.0741 541.5292 623.1276 683.3789 684.3373 729.5634 773.0139 827.0852 858.0476 919.7240 977.1896 1011.6663 1037.0851 1105.6193 1149.5337 1215.1067 1261.2412 1333.8502 1350.6336 1404.7853 1444.9246 1502.2670 1570.9061 1612.8707 1643.0966 3143.2598 3187.3169 3188.9303 3538.9706 3686.0876
redmass: 14.8591 5.6146 14.4998 5.5137 5.5221 5.5731 11.1812 8.7543 2.0280 4.4340 1.3361 1.4874 5.3700 2.4389 8.2317 6.1439 8.8897 4.0238 7.4355 1.5829 6.7395 1.3996 1.3393 2.2904 1.6255 3.3602 1.1955 5.7045 1.5572 2.4602 7.3962 5.6870 6.6443 3.7423 7.9556 2.4004 1.7905 1.0903 1.0938 1.0941 1.0462 1.1033
irintensity: 0.3139 0.0095 2.2597 0.0000 1.1626 13.7162 4.0380 0.3060 50.5969 0.4491 18.3072 178.7115 2.4012 53.4275 9.5643 12.3841 40.7982 7.9448 4.0596 48.2682 10.9478 25.3323 0.9471 4.8282 15.9525 48.4095 56.1042 551.3208 61.7256 52.0973 81.8901 52.8591 7.4220 52.9224 0.0283 21.3175 419.3829 9.5013 1.1472 9.1127 152.2599 44.8997
temp: 298.150 k
press: 1.00000 atm
elementType: 17 8 8 7 7 6 6 6 6 6 6 1 1 1 1 1
symmnumber: 1
zpe: 282127.2 jmol-1
zpe.correction: 0.107457 hartree
zpe.thermalcorrener: 0.117037 hartree
zpe.thermalcorrenthalpy: 0.117981 hartree
zpe.thermalcorrgfe: 0.071957 hartree
zpe.sumelectzpe: -950.784487 hartree
zpe.sumelectthermal: -950.774906 hartree
zpe.sumelectthermalent: -950.773962 hartree
zpe.sumelectthermalfe: -950.819986 hartree
dipole: 6.7263 4.0074 0.0005
dipole: 7.8296
quadrupole: -77.9144 -62.8994 -72.0991
quadrupole: 4.1415 -0.0014 -0.0001
quadrupole: -6.9434 8.0715 -1.1281 4.1415 -0.0014 -0.0001
hfenergy: -950.8919432 hartree
pointgroup: C01 [X(C6H5Cl1N2O2)]
dipole: -2.8490182 -1.1712631 0.000182 debye
dipolederiv: -0.4080389 0.2969495 0.0000033 0.3397137 -0.4706338 -0.000002 0.0000058 0.0000043 -0.0549296 -0.9671959 0.1965306 0.0000034 0.4044668 -0.5851053 0.0000325 0.0001174 -0.0000503 -0.2427409 -0.7188548 -0.1953981 0.0000162 -0.4627289 -0.788546 -0.0000212 0.0000988 0.0000868 -0.2432568 2.2576965 0.1467653 -0.0000743 0.2454008 1.0806369 -0.0000221 -0.0001826 -0.0000337 0.1881354 -1.688409 -0.30076 0.0000309 -0.2749582 -0.1932737 0.0000036 0.0000427 0.0000077 -0.6665399 -1.1511993 -0.1485 0.0000557 -0.2018181 -0.1453829 0.0000112 0.0000185 0.0000071 0.0071059 1.5884696 0.4801269 -0.0000379 0.3907573 -0.0065497 -0.0000067 -0.0000359 -0.0000061 0.1717328 0.4181902 0.0725109 -0.0000132 -0.0960608 -0.1398251 0.0000094 -0.0000285 -0.0000071 -0.0325811 0.3931421 0.1758836 -0.00001 0.3329528 0.1358773 -0.000016 -0.0000377 -0.0000047 -0.0857107 0.032717 -0.5463002 0.0000097 -1.1180385 0.5560009 0.0000137 0.0000029 -0.000005 -0.1189433 -0.5630207 -0.1958497 0.0000129 0.4072232 0.1185119 -0.000009 -0.0000069 -0.0000042 -0.1999453 0.1403864 -0.0382002 -0.0000005 0.0127785 0.0815357 -0.0000006 0.0000034 0.0000025 0.1757717 0.0897744 0.0691252 -0.0000018 0.0215469 0.0740603 0.0000022 0.0000008 0.0000005 0.1709993 0.016669 -0.0725179 0.0000051 -0.053736 -0.0643367 0.000003 0.0000144 0.0000035 0.1691031 0.3040776 0.0160734 -0.0000004 -0.064074 0.1876761 0.0000047 -0.0000061 0.0000017 0.3762668 0.2555957 0.0435606 0.0000009 0.1165745 0.1593542 -0.0000027 -0.0000071 -0.0000032 0.3855327 unknown
polarizability: 172.2198538|-0.3316501|111.325456|-0.0040954|-0.0010908|36.3209904 unknown
InChI: InChI=1S/C6H5ClN2O2/c7-5-3-4(9(10)11)1-2-6(5)8/h1-3H,8H2
charge 0 multiplicity 1
16 atoms
Cl -2.510158 2.12792 0.000057
O  3.184996 -0.849442 -0.000126
O  2.78101 1.400489 -0.000145
N  2.381975 0.167731 0.000047
N  -3.214147 -0.825592 0.000105
C  0.938263 -0.094099 0.000052
C  -1.855095 -0.594647 0.000075
C  0.04214 1.00198 0.000043
C  0.466999 -1.428827 0.00006
C  -1.325963 0.73503 0.000058
C  -0.91161 -1.670542 0.000078
H  0.434286 2.02177 0.000031
H  1.190929 -2.2474 0.000065
H  -1.287293 -2.699705 0.000096
H  -3.865348 -0.042239 0.000098
H  -3.581883 -1.773025 0.000106
