program: Gaussian 09
title: 000105746
version: EM64L-G09RevD.01
frameworkgroup: C1[X(C10H12Cl2O2)]
method: RPBEPBE
basis: SDD
operation: Freq
keyword: #p
keyword: freq=noraman
keyword: PBEPBE/SDD
title: #p freq=noraman PBEPBE/SDD
converged: YES YES NO NO
title: Mulliken charges:
elementType: Cl Cl O O C C C C C C C C C C H H H H H H H H H H H H
charge: -0.028168 -0.028169 -0.245156 -0.245152 0.473066 0.473074 -0.362275 -0.362269 -0.289582 -0.289577 -0.246054 -0.246057 -0.681707 -0.681710 0.276300 0.276302 0.212192 0.212000 0.212002 0.212193 0.208194 0.235671 0.235507 0.208194 0.235672 0.235507
chargesum: 0.00000
title: Mulliken charges with hydrogens summed into heavy atoms:
elementType: Cl Cl O O C C C C C C C C C C
charge: -0.028168 -0.028169 -0.245156 -0.245152 0.473066 0.473074 -0.362275 -0.362269 -0.013282 -0.013275 0.178139 0.178138 -0.002334 -0.002337
polarizability: 1.98284195e+02 6.48313354e+00 1.54676911e+02 -3.31150580e-03 -1.28355679e-03 7.12798381e+01
1716.lowfreq: -5.4827 -4.4821 0.0015 0.0017 0.0025 7.2390 34.2352 73.2968 88.1206
frequency: 34.2351 73.2943 88.1206 98.5713 102.8862 104.4735 113.7678 179.8623 181.0629 233.2286 234.6165 239.3850 249.2334 272.8303 311.3882 314.2234 375.0391 430.3383 442.7550 519.9203 520.7752 604.3412 635.3692 688.8004 692.9437 750.1233 816.8197 821.4179 840.2410 848.4525 848.5812 909.1002 950.0386 1032.7084 1038.6467 1050.6664 1115.7504 1115.8210 1135.2467 1135.3203 1186.8215 1242.0930 1264.0772 1264.0880 1279.9632 1338.2077 1356.6556 1370.8771 1394.3552 1400.7668 1402.8332 1459.4277 1459.4343 1467.6219 1477.1228 1481.1814 1488.5624 1495.2624 1552.8036 1618.5975 2955.5916 2955.9834 2999.6246 2999.7193 3015.1000 3015.1796 3097.1377 3097.1430 3109.7019 3109.7372 3177.8448 3179.7736
redmass: 3.9106 4.2104 11.2487 3.6252 1.5672 1.6456 5.5391 13.2443 6.3282 1.2027 1.2551 5.9167 5.4736 3.6550 3.8849 20.2899 11.1885 5.0100 3.0335 8.4048 5.1621 5.3253 9.5362 6.8323 2.5891 4.4296 1.4164 1.1736 1.2886 1.3108 3.6597 3.5670 5.3513 2.8173 3.0190 2.8459 2.1837 2.2584 1.4353 1.4355 2.3225 1.4717 1.1396 1.1402 3.9243 8.9871 1.5542 1.3524 2.2843 1.2686 1.6891 1.0394 1.0394 1.6705 1.0538 1.1761 1.0816 1.3701 8.1119 8.6724 1.0552 1.0553 1.0362 1.0362 1.1078 1.1078 1.0989 1.0989 1.1014 1.1014 1.0909 1.0917
irintensity: 2.5811 0.0001 0.3493 2.5812 6.1703 0.0004 0.0001 1.4065 1.3301 0.0000 2.1045 0.0000 0.0000 0.0000 0.8349 0.0000 0.0000 10.7261 8.0818 11.1173 0.0000 0.0000 1.0773 0.0000 0.0002 73.9064 0.0001 42.8475 0.0000 20.4224 0.0483 127.2884 0.0000 128.4067 0.0003 130.9893 0.0017 11.9166 10.4825 0.0026 372.9536 0.0000 0.0013 0.0001 0.0001 124.6163 88.7621 0.0001 28.1195 0.0006 59.9028 0.0077 24.5926 296.2615 0.0011 65.4107 0.0001 53.7405 0.0001 0.0001 75.8056 0.0000 45.8227 0.0046 0.0005 69.7848 46.3227 4.7169 0.0064 62.6972 3.1413 0.0000
temp: 298.150 k
press: 1.00000 atm
elementType: 17 17 8 8 6 6 6 6 6 6 6 6 6 6 1 1 1 1 1 1 1 1 1 1 1 1
symmnumber: 1
zpe: 519560.2 jmol-1
zpe.correction: 0.197890 hartree
zpe.thermalcorrener: 0.213214 hartree
zpe.thermalcorrenthalpy: 0.214158 hartree
zpe.thermalcorrgfe: 0.154257 hartree
zpe.sumelectzpe: -1457.741455 hartree
zpe.sumelectthermal: -1457.726132 hartree
zpe.sumelectthermalent: -1457.725187 hartree
zpe.sumelectthermalfe: -1457.785088 hartree
dipole: 0.0000 0.0000 0.0057
dipole: 0.0057
quadrupole: -80.4921 -97.0238 -98.2209
quadrupole: -19.0080 -0.0003 0.0005
quadrupole: 11.4202 -5.1116 -6.3086 -19.0080 -0.0003 0.0005
hfenergy: -1457.9393452 hartree
pointgroup: C01 [X(C10H12Cl2O2)]
dipole: -0.0000171 0.0000102 -0.0022281 debye
dipolederiv: -0.2144147 0.2208885 0.0000518 0.3102985 -0.6477956 -0.0001061 0.0000074 -0.0000211 -0.0442298 -0.214416 0.2208891 -0.0000667 0.3102981 -0.6477963 0.0001401 -0.000026 0.0000518 -0.0442299 -1.9783074 -0.310762 -0.000635 -0.2612503 -0.3184938 -0.0001076 -0.0008369 -0.0003243 -0.2591521 -1.9782866 -0.3107729 0.0005569 -0.2612691 -0.3185063 0.0000949 0.0007668 0.0003091 -0.2591493 1.5065946 0.2384933 0.0007374 -0.089006 -0.3112767 -0.0003156 0.0005718 -0.0002555 0.1015971 1.5065863 0.238507 -0.0006752 -0.0889931 -0.3112753 0.0003222 -0.0005053 0.0002797 0.1015961 0.0433983 -0.1823412 -0.0002362 -0.6084517 0.9993446 0.0001787 -0.0005804 0.0000989 -0.0986628 0.0434002 -0.1823451 0.0002463 -0.6084519 0.9993432 -0.0002431 0.0006025 -0.0001443 -0.0986635 -0.2359868 -0.1698928 -0.0002214 0.2850333 -0.1539052 0.0001641 -0.0001843 -0.0001654 -0.1462214 -0.2359884 -0.1698933 0.0002215 0.2850359 -0.1539078 -0.00015 0.0001713 0.0001564 -0.1462213 0.8960815 0.2205715 0.0000513 0.6418502 0.471 0.0004713 0.0012151 0.0002079 0.3967472 0.8960517 0.2205682 -0.0000281 0.6418515 0.471013 -0.0004393 -0.0012041 -0.0001971 0.396744 -0.1518222 0.0218682 0.0003043 -0.0163582 0.0519525 -0.0007269 0.000895 -0.0004356 0.0509403 -0.1518203 0.0218633 -0.0003144 -0.0163583 0.0519551 0.0007272 -0.0009069 0.0004375 0.0509406 0.06539 -0.0582845 0.0000781 -0.0771563 0.0122059 0.0000084 -0.0000411 0.0001713 0.1662251 0.0653934 -0.0582847 -0.0000801 -0.0771567 0.0122061 -0.0000068 0.0000398 -0.0001678 0.166224 -0.0302217 0.0471472 0.072571 -0.1020589 -0.0574486 -0.0880005 0.0292352 -0.1127519 -0.0860997 -0.0301959 0.0468879 -0.0722805 -0.102028 -0.058138 0.0881458 -0.0293885 0.1129425 -0.0858831 -0.0301976 0.0468965 0.0722851 -0.1020223 -0.0581397 -0.0881484 0.0293969 -0.1129371 -0.0858754 -0.030212 0.0471466 -0.0725731 -0.102059 -0.0574457 0.0879916 -0.0292371 0.1127502 -0.0861054 -0.0527968 -0.0977683 0.0003311 -0.1412474 -0.059981 0.0010235 0.0003126 0.0009376 0.1160512 0.0918587 0.0113753 0.0113757 0.0801411 0.0355935 -0.1027496 0.0435452 -0.0984302 -0.0548472 0.0904253 0.0118157 -0.0120425 0.0802314 0.0369428 0.1021366 -0.0450341 0.0980175 -0.0564643 -0.0527896 -0.0977665 -0.0003393 -0.141248 -0.0599881 -0.0010314 -0.0003205 -0.000943 0.1160509 0.0918589 0.011371 -0.0113711 0.0801375 0.0355959 0.1027531 -0.0435401 0.098429 -0.0548484 0.090417 0.0118221 0.0120531 0.0802377 0.0369455 -0.1021322 0.0450454 -0.0980159 -0.0564628 unknown
polarizability: 197.0058602|-9.8051826|155.955246|0.0032009|-0.0015387|71.2798381 unknown
InChI: InChI=1S/C10H12Cl2O2/c1-3-13-9-5-8(12)10(14-4-2)6-7(9)11/h5-6H,3-4H2,1-2H3
charge 0 multiplicity 1
26 atoms
Cl -1.376472 2.898526 -0.379261
Cl 1.376585 -2.898518 -0.379104
O  -2.813099 0.293001 -0.380006
O  2.813207 -0.292975 -0.37987
C  -1.431574 0.102303 -0.37946
C  1.431684 -0.102292 -0.379394
C  -0.607822 1.254877 -0.379416
C  0.607934 -1.254868 -0.379348
C  -0.793629 -1.165706 -0.379437
C  0.79374 1.165715 -0.379442
C  -3.673084 -0.909971 -0.382546
C  3.673156 0.910021 -0.382381
C  -5.115954 -0.414489 -0.382981
C  5.11604 0.414579 -0.382747
H  -1.379483 -2.087564 -0.379044
H  1.379597 2.087572 -0.379058
H  -3.452637 -1.516087 -1.285411
H  -3.454522 -1.519003 0.518824
H  3.454535 1.519057 0.518973
H  3.452727 1.516118 -1.285262
H  -5.8104 -1.274144 -0.378171
H  -5.314802 0.203085 0.509095
H  -5.317984 0.195942 -1.279217
H  5.81046 1.274254 -0.3779
H  5.314862 -0.202993 0.509336
H  5.318134 -0.195843 -1.278975
