program: Gaussian 09
title: 000105742
version: EM64L-G09RevD.01
frameworkgroup: C1[X(C11H14N2O2)]
method: RPBEPBE
basis: SDD
operation: Freq
keyword: #p
keyword: freq=noraman
keyword: PBEPBE/SDD
title: #p freq=noraman PBEPBE/SDD
converged: YES YES NO NO
title: Mulliken charges:
elementType: O O N N C C C C C C C C C C C H H H H H H H H H H H H H H
charge: -0.236963 -0.238035 -0.186163 0.010605 -0.391065 -0.349535 -0.460304 -0.466577 0.275660 0.375396 -0.312653 -0.561215 -0.420759 -0.806769 0.400943 0.214223 0.250862 0.226228 0.235895 0.234666 0.228563 0.236369 0.226077 0.247390 0.283104 0.282074 0.242200 0.228210 0.231574
chargesum: 0.00000
title: Mulliken charges with hydrogens summed into heavy atoms:
elementType: O O N N C C C C C C C C C C C
charge: -0.236963 -0.238035 -0.186163 0.010605 0.074020 0.112588 0.002925 -0.004131 0.275660 0.375396 -0.065263 -0.278111 -0.138685 -0.104786 0.400943
polarizability: 2.63033367e+02 -2.45370821e+00 1.44095861e+02 3.69694030e+00 8.59185752e-02 7.73315458e+01
1716.lowfreq: -11.8292 -5.9648 -1.4160 -0.0006 -0.0003 0.0006 43.6520 64.7586 82.1715
frequency: 43.5917 64.7326 82.1591 118.2131 140.8057 180.5828 205.7085 218.5100 244.9574 257.6874 281.2165 302.2171 341.0803 421.7224 458.8535 479.7586 532.6376 552.5990 557.5161 576.4529 652.0142 680.0537 731.8239 737.9072 740.7515 818.1273 861.6340 873.9687 898.4759 921.6088 925.6855 936.1747 954.9061 972.7504 982.6404 1000.3789 1046.1555 1065.2356 1097.0617 1114.2115 1118.4830 1150.1645 1164.7397 1170.4896 1193.8246 1220.6121 1230.2861 1245.3487 1286.9607 1304.5953 1314.9022 1329.9633 1340.2170 1342.0177 1356.0428 1392.4922 1400.9333 1435.1179 1469.9635 1473.0166 1475.9710 1480.5675 1491.4975 1499.1155 1509.1437 1573.2881 1615.0309 2933.3448 2981.1432 2993.2224 3010.6268 3013.3417 3037.3176 3045.9996 3068.3404 3082.0394 3089.8906 3094.7216 3164.2362 3166.4112 3186.2305
redmass: 4.4269 5.7212 3.4572 3.3169 5.3097 3.0702 2.7144 1.3173 2.9322 2.5926 2.8287 3.4204 4.0020 5.8662 3.0640 6.2809 3.7200 5.5336 3.9816 1.9621 6.9004 5.3974 3.6971 4.4012 4.6082 1.5604 1.6816 1.7626 4.4369 2.5588 1.3713 1.4007 4.8863 1.4203 1.6023 1.5377 1.5067 1.7664 1.7196 2.1927 2.2061 1.5766 1.5772 1.7661 2.1281 4.6619 1.2803 1.3881 1.4728 1.3515 1.2605 1.6477 1.9253 2.4572 3.2552 4.2672 1.3303 3.8053 1.0888 1.0936 1.0599 1.1699 1.1777 1.4682 1.6734 8.4364 6.2693 1.0676 1.0444 1.0507 1.0663 1.0647 1.0926 1.1035 1.0981 1.1010 1.0982 1.1054 1.0915 1.0874 1.0965
irintensity: 0.7646 0.4110 0.8158 0.7155 1.0324 0.0591 18.1798 0.9369 0.4117 0.0900 1.4806 2.4332 5.7895 1.8273 5.8514 0.4356 2.5662 0.5758 4.1421 1.5972 5.8936 13.7549 3.8840 1.8911 5.6029 40.5867 8.3873 3.5489 2.6096 5.4401 18.5786 2.5546 20.4693 2.5854 8.4709 6.2367 6.9249 3.3886 19.8169 0.9427 2.7156 74.5581 2.5645 25.8923 3.5680 755.4416 17.5202 43.2009 53.4127 4.4037 0.0320 8.7728 44.7483 72.1469 197.9721 15.1809 15.4111 44.0806 12.3620 44.0302 14.0827 12.9676 53.5387 53.5103 33.0170 30.6782 248.1227 58.1751 1.3805 73.5756 37.4032 19.5048 37.0807 10.4339 29.1129 36.3149 18.0675 51.0800 1.6512 5.5309 6.7831
temp: 298.150 k
press: 1.00000 atm
elementType: 8 8 7 7 6 6 6 6 6 6 6 6 6 6 6 1 1 1 1 1 1 1 1 1 1 1 1 1 1
symmnumber: 1
zpe: 619212.3 jmol-1
zpe.correction: 0.235846 hartree
zpe.thermalcorrener: 0.249364 hartree
zpe.thermalcorrenthalpy: 0.250308 hartree
zpe.thermalcorrgfe: 0.195343 hartree
zpe.sumelectzpe: -686.323605 hartree
zpe.sumelectthermal: -686.310086 hartree
zpe.sumelectthermalent: -686.309142 hartree
zpe.sumelectthermalfe: -686.364107 hartree
dipole: -10.3111 0.3864 -0.1284
dipole: 10.3191
quadrupole: -109.8757 -82.7976 -89.1828
quadrupole: 2.6588 -2.2986 0.0381
quadrupole: -15.9237 11.1544 4.7693 2.6588 -2.2986 0.0381
hfenergy: -686.5594505 hartree
pointgroup: C01 [X(C11H14N2O2)]
dipole: 4.0561099 -0.17137 -0.0309739 debye
polarizability: 262.993659|-3.5433801|141.4774589|-3.6964402|-12.9886228|79.9896557 unknown
InChI: InChI=1S/C11H14N2O2/c1-9-8-10(13(14)15)4-5-11(9)12-6-2-3-7-12/h4-5,8H,2-3,6-7H2,1H3
charge 0 multiplicity 1
29 atoms
O  -4.217597 1.372757 -0.129874
O  -4.273742 -0.869323 0.317289
N  2.060411 0.067728 -0.177152
N  -3.630447 0.229018 0.056619
C  2.810031 1.27114 -0.629906
C  2.957959 -0.855414 0.584257
C  4.286192 0.836357 -0.543897
C  4.290639 -0.076615 0.706279
C  0.665475 0.050044 -0.145337
C  -0.10607 -1.160651 0.055724
C  -0.045438 1.280924 -0.358791
C  -1.506478 -1.06176 0.128419
C  -1.440554 1.353385 -0.298821
C  0.509111 -2.553482 0.069159
C  -2.172942 0.176479 -0.028682
H  2.626386 2.137893 0.042409
H  2.500294 1.559357 -1.650726
H  3.112083 -1.805512 0.04101
H  2.524723 -1.089161 1.5735
H  4.968515 1.69755 -0.452296
H  4.570674 0.261744 -1.444098
H  5.160442 -0.753109 0.746939
H  4.292647 0.540247 1.623577
H  0.513024 2.20051 -0.547882
H  -2.114262 -1.959277 0.277096
H  -1.972452 2.297718 -0.44099
H  -0.288488 -3.312555 0.010996
H  1.173428 -2.702853 -0.801949
H  1.097736 -2.768538 0.978431
