program: Gaussian 09
title: 000105734
version: EM64L-G09RevD.01
frameworkgroup: C1[X(C18H28N2O4)]
method: RPBEPBE
basis: SDD
operation: Freq
keyword: #p
keyword: freq=noraman
keyword: PBEPBE/SDD
title: #p freq=noraman PBEPBE/SDD
converged: YES YES NO NO
title: Mulliken charges:
elementType: O O O O N N C C C C C C C C C C C C C C C C C C H H H H H H H H H H H H H H H H H H H H H H H H H H H H
charge: -0.292602 -0.206275 -0.264431 -0.212937 -0.181120 0.007028 -0.329535 -0.387712 -0.459206 -0.461071 0.300171 0.255556 -0.495855 0.231330 -0.541449 0.260073 -0.277288 -0.384684 -0.296221 -0.380990 -0.340092 -0.341011 -0.687398 -0.686873 0.231375 0.245674 0.216888 0.240226 0.233116 0.222496 0.231355 0.227433 0.278373 0.311442 0.211336 0.209027 0.201692 0.205177 0.201303 0.202712 0.219070 0.218755 0.198456 0.197917 0.190411 0.190126 0.210880 0.221206 0.210375 0.215271 0.215356 0.215145
chargesum: 0.00000
title: Mulliken charges with hydrogens summed into heavy atoms:
elementType: O O O O N N C C C C C C C C C C C C C C C C C C
charge: -0.292602 -0.206275 -0.264431 -0.212937 -0.181120 0.007028 0.147513 0.069403 -0.003594 -0.002283 0.300171 0.255556 -0.217483 0.231330 -0.230007 0.260073 0.143075 0.022184 0.107794 0.056836 0.056281 0.039526 -0.044936 -0.041101
polarizability: 3.20927088e+02 2.41290573e+01 3.10268348e+02 -1.65773185e+00 2.53014380e+00 1.40410405e+02
1716.lowfreq: -21.1034 -18.0514 -9.3738 -4.5961 -0.0006 0.0004 0.0006 20.1696 27.7697
frequency: -18.0551 11.9429 27.6099 31.9450 39.3854 39.9492 47.0089 51.0643 57.6488 82.3289 109.1076 115.4181 125.5126 144.4241 146.2756 165.7867 178.4815 184.5106 187.3475 199.1411 236.2086 238.2363 249.9542 255.5686 268.5562 274.0945 299.4499 352.9869 360.1931 400.6758 420.3511 444.0971 462.2676 469.0837 536.7049 541.1137 572.7551 631.7192 647.3131 679.0818 702.9290 713.7652 719.8664 740.1927 741.4691 743.7359 800.7982 808.4976 815.1825 826.1733 858.6079 869.1606 892.9208 896.6464 903.4702 917.9363 922.2792 926.0724 938.7903 940.8721 950.2205 969.5737 983.1755 1038.9901 1040.7009 1056.7037 1071.6893 1083.3551 1085.3677 1114.8596 1123.2761 1123.7454 1132.7381 1140.5624 1147.0057 1160.2077 1167.8741 1179.7944 1204.5414 1210.1733 1211.8232 1214.3352 1228.1055 1241.5930 1268.6493 1270.2214 1280.2404 1280.4395 1280.6317 1282.9731 1283.8459 1302.9954 1309.8382 1314.2041 1333.4900 1338.8030 1342.9607 1344.0628 1359.2305 1373.2871 1380.1726 1392.0959 1392.8462 1411.5255 1434.6208 1466.7726 1468.0833 1468.5247 1470.5573 1473.0612 1473.7791 1478.4674 1479.1859 1480.7301 1483.1640 1484.4358 1489.4419 1490.9321 1493.6720 1528.7702 1560.8857 1615.1472 2931.5939 2941.6579 2950.4322 2961.9233 2969.6324 2975.8972 2977.5058 2987.0929 3002.1754 3002.5754 3004.3843 3005.8537 3006.1098 3006.6957 3009.1880 3014.4047 3021.0815 3054.0175 3066.1768 3073.8966 3076.3758 3077.1274 3077.6583 3078.7738 3085.8747 3097.1320 3186.9161 3197.7329
redmass: 2.9988 2.4171 2.9136 2.4267 3.9945 3.8348 3.0796 3.9158 3.0255 3.1252 3.4858 3.7664 4.2420 2.0535 1.9215 4.0693 3.8811 4.6876 5.5230 3.1977 1.0974 1.0973 4.4448 2.0312 4.3843 4.3445 5.8204 3.7172 4.0717 8.7090 4.4992 4.5635 3.2517 4.9587 5.8370 6.9691 1.9158 6.8172 6.1370 5.0593 3.1690 4.4491 4.0334 1.0869 1.0794 6.2318 4.1936 1.6593 1.1446 1.4402 1.7081 1.8663 2.6138 1.3925 1.8274 3.0818 2.1221 1.5392 1.1511 1.1480 6.3357 5.0815 1.8573 3.4004 3.2843 2.5186 2.2206 2.1897 2.2526 1.5948 2.5986 2.6334 3.1277 1.4263 1.4740 1.6577 1.5335 3.2002 8.2279 3.4253 1.3981 1.3645 1.3537 1.2866 1.3066 1.3129 1.1071 1.2950 1.2266 1.1281 1.0798 1.5407 2.7319 1.2830 1.9845 1.4574 1.4536 1.4950 3.8486 1.4835 1.4881 1.2304 1.2209 4.8416 6.5826 1.0860 1.0850 1.0793 1.0920 1.0727 1.0941 1.0422 1.0426 1.0908 1.0754 1.0799 1.0933 1.0971 1.1085 3.4828 9.8941 6.5197 1.0658 1.0545 1.0554 1.0587 1.0586 1.0367 1.0359 1.0586 1.1055 1.0598 1.0718 1.0904 1.0860 1.1016 1.0627 1.1026 1.0808 1.1049 1.1037 1.1013 1.0996 1.0994 1.1017 1.0986 1.1013 1.1045 1.0895 1.0886
irintensity: 0.7417 0.0275 0.1187 0.0690 0.2094 0.1717 0.3247 0.8520 0.9350 0.8647 0.4371 0.1289 0.7275 0.1329 5.6012 2.6252 0.6402 0.2893 0.8699 7.6800 0.0587 0.0761 2.1373 0.6560 1.4960 1.0283 0.0791 0.5945 1.9934 0.0610 0.6854 0.9665 1.0399 10.8806 4.3617 0.8940 2.0110 4.8153 3.7595 3.3093 0.7482 3.8033 13.9520 10.1365 10.0829 10.1773 8.3109 16.0315 0.0351 16.0822 8.4767 1.3916 5.3320 25.0721 32.1659 16.1967 14.8362 6.2060 0.4906 0.1229 45.6056 129.4584 3.5810 5.8537 49.3324 9.1346 16.1870 0.2450 6.7558 3.8317 10.1279 2.0693 7.6926 1.8144 2.0793 35.4037 6.8055 374.3923 710.2428 130.8799 0.9328 0.0076 8.9714 16.9050 1.2119 0.5763 1.1856 30.6974 16.3981 0.5048 0.1984 20.0686 10.4363 1.7957 63.3262 23.1965 0.0393 0.9027 221.8002 66.9065 14.9106 12.9803 1.8777 15.0301 123.4066 8.4455 12.0679 3.7425 13.0620 1.8505 43.5717 12.8913 13.3525 30.8858 12.7471 0.9102 37.8485 15.3036 31.8753 290.0532 167.7446 280.0442 49.6720 31.8418 20.0151 38.6885 21.3411 35.0994 37.9686 43.1455 30.3915 22.9814 43.8533 7.6915 17.8923 7.7929 28.1104 0.0950 55.6882 28.2072 5.3527 93.6213 47.7503 45.4083 99.6022 41.9623 18.3493 51.6102 7.9540 7.3724
temp: 298.150 k
press: 1.00000 atm
elementType: 8 8 8 8 7 7 6 6 6 6 6 6 6 6 6 6 6 6 6 6 6 6 6 6 1 1 1 1 1 1 1 1 1 1 1 1 1 1 1 1 1 1 1 1 1 1 1 1 1 1 1 1
symmnumber: 1
zpe: 1148820.0 jmol-1
zpe.correction: 0.437562 hartree
zpe.thermalcorrener: 0.463075 hartree
zpe.thermalcorrenthalpy: 0.464019 hartree
zpe.thermalcorrgfe: 0.378171 hartree
zpe.sumelectzpe: -1111.140498 hartree
zpe.sumelectthermal: -1111.114986 hartree
zpe.sumelectthermalent: -1111.114042 hartree
zpe.sumelectthermalfe: -1111.199890 hartree
dipole: 2.8034 9.7727 0.1266
dipole: 10.1676
quadrupole: -122.6674 -159.5180 -144.0370
quadrupole: -15.3832 -0.7818 -1.1960
quadrupole: 19.4067 -17.4439 -1.9629 -15.3832 -0.7818 -1.1960
hfenergy: -1111.5780608 hartree
pointgroup: C01 [X(C18H28N2O4)]
dipole: -1.6936062 3.622419 -0.1082069 debye
polarizability: 328.1562247|-21.2084547|302.9652037|2.0999468|-4.4574853|140.4844124 unknown
InChI: InChI=1S/C18H28N2O4/c1-3-5-11-23-17-14-16(20(21)22)18(24-12-6-4-2)13-15(17)19-9-7-8-10-19/h13-14H,3-12H2,1-2H3
charge 0 multiplicity 1
52 atoms
O  -2.666379 -0.504578 0.352001
O  2.993738 -0.581388 0.481496
O  0.694728 -4.141545 0.591526
O  2.784107 -3.224638 0.557871
N  -1.194946 1.938772 0.353365
N  1.494981 -3.105981 0.552876
C  -2.63795 2.217492 0.631847
C  -0.432266 3.19916 0.161937
C  -2.66948 3.739973 0.896763
C  -1.52374 4.279934 0.00753
C  -0.556178 0.709946 0.403992
C  -1.258762 -0.555429 0.424609
C  0.86971 0.654442 0.415279
C  1.603646 -0.553907 0.461706
C  -0.541682 -1.750024 0.480477
C  0.879029 -1.785705 0.501465
C  -3.388345 -1.791702 0.332908
C  -4.88313 -1.478849 0.23684
C  3.729326 0.701209 0.436308
C  5.218152 0.350368 0.455433
C  -5.73966 -2.767164 0.228395
C  6.108388 1.614726 0.426443
C  -7.250963 -2.468862 0.129723
C  7.613428 1.270947 0.443372
H  -3.260719 1.944263 -0.239453
H  -2.990426 1.625295 1.489812
H  0.210753 3.411208 1.044155
H  0.222958 3.129036 -0.727093
H  -3.650815 4.17968 0.652106
H  -2.454454 3.948149 1.961292
H  -1.166343 5.277066 0.31406
H  -1.853228 4.3392 -1.045896
H  1.421538 1.594108 0.411116
H  -1.039197 -2.721615 0.494538
H  -3.048182 -2.391015 -0.537341
H  -3.15901 -2.357508 1.260097
H  -5.175825 -0.84039 1.093199
H  -5.074208 -0.894806 -0.684307
H  3.454447 1.319498 1.317112
H  3.46004 1.252832 -0.489251
H  5.433295 -0.24645 1.361542
H  5.445812 -0.296056 -0.412755
H  -5.433486 -3.409293 -0.622152
H  -5.537347 -3.350833 1.149203
H  5.86766 2.258626 1.297363
H  5.87704 2.211828 -0.479709
H  -7.486562 -1.913941 -0.797694
H  -7.844135 -3.401181 0.125503
H  -7.591512 -1.855193 0.98477
H  7.87925 0.703329 1.354445
H  8.23626 2.183681 0.418313
H  7.886745 0.649285 -0.429436
