program: Gaussian 09
title: 000105688
version: EM64L-G09RevD.01
frameworkgroup: C1[X(C13H11NO3)]
method: RPBEPBE
basis: SDD
operation: Freq
keyword: #p
keyword: freq=noraman
keyword: PBEPBE/SDD
title: #p freq=noraman PBEPBE/SDD
converged: YES YES NO YES
title: Mulliken charges:
elementType: O O O N C C C C C C C C C C C C C H H H H H H H H H H H
charge: -0.441708 -0.434821 -0.254578 -0.489044 0.611281 0.249096 -0.518096 -0.693516 0.137267 0.393328 0.385601 -0.569845 -0.342388 -0.358057 -0.221991 -0.236789 -0.226175 0.313461 0.332159 0.214446 0.247861 0.275607 0.216484 0.234504 0.230667 0.234319 0.354390 0.356536
chargesum: 0.00000
title: Mulliken charges with hydrogens summed into heavy atoms:
elementType: O O O N C C C C C C C C C C C C C
charge: -0.087318 -0.078285 -0.254578 -0.175583 0.611281 0.249096 -0.185937 -0.479070 0.137267 0.393328 0.385601 -0.321984 -0.066781 -0.141573 0.012513 -0.006122 0.008144
polarizability: 2.68650008e+02 1.98609345e+00 1.69046992e+02 -4.28744263e+00 6.28632401e+00 6.80433013e+01
1716.lowfreq: -3.3942 -0.0008 -0.0006 -0.0005 2.7650 4.1123 29.0094 40.4102 65.9384
frequency: 28.9894 40.3662 65.9381 85.8118 154.5867 178.1922 213.5910 233.4072 239.2948 270.5418 309.4719 325.4009 338.3611 368.2573 401.5557 410.4450 468.6641 503.8561 514.8833 527.0963 581.8105 598.4878 610.0931 614.5265 642.4538 677.9956 686.7570 696.8567 703.4861 790.6948 796.3531 828.1476 853.1372 861.4910 905.3733 932.9842 968.7121 978.2811 983.3350 988.4948 991.3448 1006.1473 1026.7930 1083.4182 1099.1598 1124.6207 1143.6495 1174.3485 1186.7620 1189.9197 1196.5095 1246.6587 1289.0898 1316.5229 1340.8837 1384.7257 1405.4034 1433.2660 1447.8445 1478.7224 1499.5820 1531.0449 1578.7411 1609.5686 1610.1676 1617.7069 1637.3018 3108.3200 3112.8639 3133.0976 3145.8194 3152.9973 3159.3670 3170.9996 3213.6856 3537.9233 3584.0335 3587.0475
redmass: 4.7842 5.5560 5.9089 6.4683 5.4673 6.1154 5.2395 4.0132 5.4959 4.6283 7.5273 5.7595 1.1268 1.1151 2.8943 5.0499 4.3319 5.7346 4.6879 7.3238 2.4695 3.5796 6.7707 6.2174 1.5133 1.7436 4.9823 6.1873 1.5402 2.3352 1.6781 1.9352 1.3887 4.4281 1.4805 1.4568 5.0538 5.9151 1.4380 4.9938 4.1819 1.3490 2.2804 1.6592 2.2607 1.4798 1.3562 1.0580 1.2642 1.2337 1.5576 2.3251 1.4963 1.3942 3.6189 9.0838 7.7368 2.3034 3.0284 2.2631 3.3832 2.3107 5.5349 6.1761 6.6329 5.1844 6.1531 1.0914 1.0880 1.0868 1.0919 1.0928 1.0956 1.1005 1.0933 1.0758 1.0660 1.0661
irintensity: 0.1135 1.0199 1.3322 2.8105 1.6814 2.9424 2.4577 0.5892 1.2800 3.7709 12.8717 16.8443 74.2636 210.7732 0.1821 1.2455 9.7698 7.6888 5.8152 1.6585 0.6981 6.4385 31.0869 6.9198 38.7049 45.1415 9.6030 1.7043 103.3296 23.2440 11.4242 66.6998 1.4496 21.1752 53.7330 4.7053 8.3808 1.6432 2.0490 42.1024 84.4298 1.7259 15.9118 24.8311 4.8167 209.5024 150.0601 1.3476 21.9647 25.6987 44.6392 215.4824 16.8425 9.0392 61.9038 0.7977 55.7773 7.5247 220.7651 9.8713 300.5126 118.5935 61.4346 94.5624 127.2166 153.6445 170.0170 10.5849 14.4830 0.8252 21.0013 3.2181 15.8050 22.2344 16.2214 9.5539 43.3916 34.8017
temp: 298.150 k
press: 1.00000 atm
elementType: 8 8 8 7 6 6 6 6 6 6 6 6 6 6 6 6 6 1 1 1 1 1 1 1 1 1 1 1
symmnumber: 1
zpe: 555870.2 jmol-1
zpe.correction: 0.211720 hartree
zpe.thermalcorrener: 0.226336 hartree
zpe.thermalcorrenthalpy: 0.227281 hartree
zpe.thermalcorrgfe: 0.169130 hartree
zpe.sumelectzpe: -781.219434 hartree
zpe.sumelectthermal: -781.204817 hartree
zpe.sumelectthermalent: -781.203873 hartree
zpe.sumelectthermalfe: -781.262023 hartree
dipole: 1.3927 5.0011 -0.4219
dipole: 5.2085
quadrupole: -77.3569 -92.6122 -103.6646
quadrupole: 5.1040 -1.3485 1.9546
quadrupole: 13.8543 -1.4010 -12.4533 5.1040 -1.3485 1.9546
hfenergy: -781.4311537 hartree
pointgroup: C01 [X(C13H11N1O3)]
dipole: -0.5331913 -1.9735436 -0.1413537 debye
polarizability: 268.5914957|2.7886786|168.8985088|4.8301026|-7.578862|68.2502969 unknown
InChI: InChI=1S/C13H11NO3/c15-11-6-10(7-12(16)8-11)14-13(17)9-4-2-1-3-5-9/h1-8,14-16H
charge 0 multiplicity 1
28 atoms
O  4.356307 -2.414662 -0.218012
O  3.973673 2.399752 0.243187
O  -0.796136 1.910213 0.002625
N  -0.061254 -0.321304 -0.075029
C  1.352526 -0.170139 -0.045377
C  -2.466807 0.149766 -0.002704
C  1.98572 1.087092 0.084717
C  2.12279 -1.364586 -0.149633
C  -1.048972 0.667364 -0.017344
C  3.529794 -1.280505 -0.120798
C  3.398001 1.126329 0.111708
C  4.188235 -0.039356 0.010737
C  -3.48367 1.034811 -0.444422
C  -2.828694 -1.142628 0.46316
C  -4.833212 0.627477 -0.449175
C  -4.181599 -1.548037 0.462973
C  -5.18633 -0.667501 -0.000237
H  -0.394474 -1.279791 -0.194629
H  1.404711 2.006043 0.155506
H  1.625143 -2.33864 -0.250971
H  5.282937 -0.013617 0.029292
H  -3.189218 2.037743 -0.769975
H  -2.075169 -1.82574 0.875562
H  -5.609407 1.316885 -0.798494
H  -4.452458 -2.541928 0.835591
H  -6.235409 -0.98324 -0.000019
H  3.816995 -3.238155 -0.313132
H  4.961276 2.341354 0.248491
