program: Gaussian 09
title: 000105686
version: EM64L-G09RevD.01
frameworkgroup: C1[X(C13H18O4)]
method: RPBEPBE
basis: SDD
operation: Freq
keyword: #pfreq=noraman
keyword: PBEPBE/SDD
title: #p freq=noraman PBEPBE/SDD
converged: YES YES NO NO
title: Mulliken charges:
elementType: O O O O C C C C C C C C C C C C C H H H H H H H H H H H H H H H H H H
charge: -0.221035 -0.241535 -0.265210 -0.241379 0.191812 0.227076 0.231952 0.263373 -0.496158 -0.501783 -0.244056 -0.239935 -0.238415 -0.230886 -0.681662 -0.685521 -0.683768 0.268611 0.295714 0.209280 0.209241 0.212170 0.212203 0.207940 0.207866 0.206301 0.205937 0.236748 0.236685 0.207362 0.231371 0.231425 0.208315 0.234986 0.234974
chargesum: 0.00000
title: Mulliken charges with hydrogens summed into heavy atoms:
elementType: O O O O C C C C C C C C C C C C C
charge: -0.221035 -0.241535 -0.265210 -0.241379 0.191812 0.227076 0.231952 0.263373 -0.227547 -0.206069 0.174464 0.184438 0.177391 -0.024585 -0.002292 -0.015362 -0.005493
polarizability: 2.15494957e+02 8.15135670e+00 2.11761834e+02 6.24860119e-02 -1.83927735e-02 9.09471609e+01
1716.lowfreq: -7.5016 -4.3807 -1.7679 -0.0003 -0.0002 0.0006 30.4710 46.4109 69.7948
frequency: 30.4349 46.3255 69.7871 91.1091 93.9939 98.2090 105.9253 107.2470 126.9420 134.9769 171.5201 205.8578 210.7497 237.7245 238.9963 240.8382 259.3911 265.2485 285.3815 316.9641 332.6973 393.5281 428.5236 469.3390 501.8019 520.0623 577.0745 650.2481 678.9799 688.0372 734.3149 738.8167 818.5226 823.4185 826.5502 828.9357 849.5093 876.3150 893.0425 903.6707 946.4309 990.1468 1027.7686 1034.8032 1035.4471 1111.0805 1115.4532 1116.4718 1117.5077 1133.6591 1135.2387 1135.9973 1179.6105 1186.2856 1260.5892 1263.3217 1263.4867 1263.7710 1280.7378 1349.7635 1362.2225 1369.9390 1375.3872 1398.1460 1398.5660 1400.5976 1409.3886 1415.2132 1459.4380 1460.5703 1461.1739 1471.2639 1476.3859 1478.3720 1484.9123 1488.0149 1489.9455 1509.7485 1567.2706 1586.5746 1614.8048 2952.2941 2954.0675 2955.8072 2956.6677 2997.7901 2998.9925 2999.1189 3012.4827 3013.3434 3014.6665 3095.2125 3096.1469 3096.4730 3107.0216 3109.2501 3110.1449 3157.1007 3184.7225
redmass: 3.8980 3.9468 3.9933 3.3719 2.3592 3.4958 1.6785 1.6295 2.7135 5.1819 5.1275 3.0213 4.9530 1.1896 1.2341 1.2375 4.7927 3.7421 3.7146 4.0905 4.4336 4.1740 7.4277 2.7812 5.1565 5.7906 6.6996 5.1973 7.3124 5.1711 1.8197 5.1640 1.4662 3.2896 1.1094 1.0984 1.5120 3.0768 3.1878 1.4142 3.3283 1.8369 2.6488 2.7086 2.8298 4.5650 2.1710 2.6591 2.3516 1.4343 1.4251 1.4414 1.9460 5.7582 1.1459 1.1404 1.3559 1.1440 5.0599 1.4904 1.3227 1.3710 1.4168 1.3023 1.2645 1.2699 6.0774 4.3358 1.0396 1.0401 1.0398 1.2095 1.0628 1.0517 1.1125 1.0924 1.0806 2.1479 8.4381 6.9334 6.4359 1.0556 1.0557 1.0823 1.0582 1.0362 1.0363 1.0363 1.1076 1.1077 1.1074 1.0989 1.0988 1.0988 1.1013 1.1015 1.1015 1.0905 1.0896
irintensity: 1.8573 1.0016 1.2199 0.9331 0.4979 2.7048 3.6192 3.6918 1.3023 1.1489 11.4984 3.0102 4.2930 0.0202 1.8901 0.1024 1.4145 0.6334 1.5669 0.6923 0.5693 4.4875 2.7979 4.8736 14.7661 5.4138 20.0645 13.3924 0.0195 12.5964 3.3522 22.6742 40.6469 4.0619 3.8078 0.4608 5.8107 5.5497 36.6637 14.3605 89.1355 5.2462 12.4767 93.8600 119.2058 143.5772 1.5949 22.5242 12.6950 3.1267 6.4838 4.7484 115.4217 350.7425 0.0037 0.1149 25.0138 0.0402 427.2260 76.0053 7.0823 10.9857 29.3629 77.0383 9.8427 14.6095 109.8134 34.9640 8.7126 14.7407 13.2122 112.3440 38.2305 6.8367 63.8692 4.9726 0.3034 161.9879 150.1084 315.2197 13.7616 6.0108 75.6205 82.0443 20.8843 26.3907 28.4681 18.4619 12.2380 48.3530 41.7061 31.6143 17.7629 29.7741 32.6543 28.4902 34.4611 9.1884 8.5491
temp: 298.150 k
press: 1.00000 atm
elementType: 8 8 8 8 6 6 6 6 6 6 6 6 6 6 6 6 6 1 1 1 1 1 1 1 1 1 1 1 1 1 1 1 1 1 1
symmnumber: 1
zpe: 749507.2 jmol-1
zpe.correction: 0.285472 hartree
zpe.thermalcorrener: 0.304336 hartree
zpe.thermalcorrenthalpy: 0.305280 hartree
zpe.thermalcorrgfe: 0.237724 hartree
zpe.sumelectzpe: -805.734390 hartree
zpe.sumelectthermal: -805.715526 hartree
zpe.sumelectthermalent: -805.714582 hartree
zpe.sumelectthermalfe: -805.782138 hartree
dipole: -0.4288 6.3777 0.0011
dipole: 6.3921
quadrupole: -87.8033 -104.6651 -102.4101
quadrupole: -16.7607 -0.0487 0.0037
quadrupole: 10.4895 -6.3723 -4.1173 -16.7607 -0.0487 0.0037
hfenergy: -806.0198617 hartree
pointgroup: C01 [X(C13H18O4)]
dipole: 0.3818417 -2.4855978 -0.0208548 debye
polarizability: 218.7832881|-6.5847406|208.4659293|0.0042314|0.9440702|90.954735 unknown
InChI: InChI=1S/C13H18O4/c1-4-15-11-8-13(17-6-3)12(16-5-2)7-10(11)9-14/h7-9H,4-6H2,1-3H3
charge 0 multiplicity 1
35 atoms
O  2.016719 -1.547563 -0.336667
O  2.597503 1.035927 -0.316065
O  -2.832068 -0.52552 -0.323953
O  -2.020964 3.493229 -0.297562
C  0.922778 -0.688029 -0.329224
C  1.235714 0.714697 -0.318346
C  -1.475598 -0.169091 -0.323691
C  -1.17996 1.223971 -0.313379
C  -0.424053 -1.119322 -0.331843
C  0.182151 1.6376 -0.310956
C  1.762763 -3.004502 -0.34672
C  2.940986 2.473366 -0.301067
C  -3.185383 -1.958889 -0.344279
C  -2.244311 2.244119 -0.305147
C  3.128045 -3.685134 -0.3503
C  4.464208 2.560844 -0.296921
C  -4.709525 -2.037182 -0.349329
H  -0.645568 -2.187676 -0.340841
H  0.354277 2.71843 -0.303266
H  1.175225 -3.279572 0.553483
H  1.176844 -3.267736 -1.251544
H  2.508309 2.963981 -1.197252
H  2.504625 2.945965 0.602962
H  -2.754989 -2.430688 -1.251775
H  -2.760084 -2.454837 0.552689
H  -3.285275 1.852361 -0.307521
H  3.003638 -4.783299 -0.359135
H  3.707136 -3.389544 -1.241195
H  3.705032 -3.403614 0.546518
H  4.781514 3.619448 -0.286882
H  4.880247 2.060593 0.593996
H  4.884342 2.076398 -1.194626
H  -5.033708 -3.093617 -0.363759
H  -5.127397 -1.555022 0.550507
H  -5.122771 -1.531891 -1.23851
