program: Gaussian 09
title: 000105646
version: EM64L-G09RevD.01
frameworkgroup: C1[X(C18H27NO3)]
method: RPBEPBE
basis: SDD
operation: Freq
keyword: #p
keyword: freq=noraman
keyword: PBEPBE/SDD
title: #p freq=noraman PBEPBE/SDD
converged: YES YES NO NO
title: Mulliken charges:
elementType: O O O N C C C C C C C C C C C C C C C C C C H H H H H H H H H H H H H H H H H H H H H H H H H H H
charge: -0.481652 -0.292626 -0.257838 -0.035919 0.307541 -0.419866 -0.384326 -0.390578 -0.393408 -0.726579 -0.747784 -0.444816 -0.209643 0.160167 0.100149 -0.371191 -0.322522 -0.209130 -0.250026 0.173346 -0.235277 -0.675358 0.194506 0.207325 0.244163 0.193477 0.186387 0.203714 0.200586 0.251543 0.212114 0.201574 0.234849 0.214300 0.198950 0.255162 0.190030 0.231870 0.329108 0.226646 0.251155 0.271371 0.230154 0.230477 0.275081 0.217726 0.205504 0.228162 0.221401
chargesum: 0.00000
title: Mulliken charges with hydrogens summed into heavy atoms:
elementType: O O O N C C C C C C C C C C C C C C C C C C
charge: -0.152544 -0.292626 -0.257838 -0.035919 0.307541 -0.018035 0.053314 -0.000476 0.058720 -0.078042 -0.079372 -0.022916 0.017003 0.160167 0.100149 -0.120036 -0.051151 0.021024 -0.019549 0.173346 0.257530 -0.020291
polarizability: 2.84458062e+02 -7.59991199e+00 2.37722315e+02 -1.31236956e+01 3.97638541e+00 1.42691286e+02
1716.lowfreq: -6.7086 -0.0006 -0.0004 0.0000 2.8627 7.7235 15.4029 23.2211 31.8866
frequency: 15.2472 22.4818 31.8566 41.0047 55.4124 61.7327 68.2118 83.3382 94.6120 105.4834 114.5091 115.6257 127.7377 160.7545 181.3398 192.2874 215.0185 234.1525 251.6281 253.1783 256.1806 284.6439 287.5588 298.0002 320.4325 329.6340 346.4730 367.4572 376.9345 403.5986 422.1049 434.0640 459.6297 476.9885 515.8062 540.7248 553.7159 593.0167 649.1798 683.0787 719.5207 734.5562 746.8892 762.9777 771.6266 775.5930 798.2415 807.6115 840.1725 852.8859 868.2426 876.0095 901.3469 911.1930 919.5125 939.9268 967.5073 977.4358 989.9676 990.7318 1014.7877 1025.6070 1034.1952 1039.4689 1046.1937 1067.0859 1079.2700 1095.9998 1111.3843 1111.6605 1124.1562 1130.3103 1135.5512 1171.5185 1178.4044 1192.5288 1206.2757 1217.4915 1224.6388 1250.1552 1254.3148 1264.1767 1268.0888 1288.2056 1298.2862 1309.1254 1317.8562 1333.6690 1355.1872 1357.5737 1360.0394 1370.2899 1374.4566 1377.2214 1390.4145 1397.8963 1429.4748 1444.2610 1453.8678 1459.7199 1460.7841 1462.0780 1462.4802 1466.0201 1467.4674 1473.9760 1475.6777 1482.5164 1483.9542 1489.4943 1557.7123 1595.0412 1613.3217 1672.9741 2951.8877 2955.8322 2967.7410 2969.9201 2972.6107 2977.0032 2978.7045 2985.4625 2993.4643 3011.4360 3013.1663 3023.6464 3052.9858 3058.7979 3063.3068 3067.0710 3071.5829 3077.2355 3086.3663 3090.3438 3096.0813 3106.4690 3131.8175 3150.7823 3164.6269 3179.6268 3545.0288
redmass: 3.9697 3.4418 5.4328 4.2507 3.7862 3.5348 4.6003 4.5495 2.4609 2.6160 3.1819 2.4288 2.2672 2.4951 2.8231 3.1246 1.0722 2.8704 1.3848 1.6973 1.8421 1.2883 2.5326 3.8475 2.6300 3.4391 3.0263 3.0185 3.7732 2.3265 3.7333 3.3003 2.7343 4.0548 3.3702 3.3973 3.7573 4.7081 6.5957 4.6126 1.2668 3.2556 1.9488 2.0084 2.9270 1.6299 2.6176 1.3212 2.5776 2.5728 2.2290 1.4741 2.2651 1.6536 1.7148 1.6992 1.3726 1.4176 1.5775 1.3281 2.5714 3.0229 4.4354 2.0109 1.9142 2.0372 2.1754 2.7474 1.6776 2.1926 1.7376 1.4600 1.3939 1.0751 2.2058 1.8448 2.4882 2.4722 1.9011 1.3855 1.1481 1.3694 1.4673 1.2922 1.0784 1.2832 1.2197 1.7324 1.4943 1.4499 1.7123 2.3142 1.2472 2.2485 1.2189 1.2798 2.2230 1.0761 1.1413 1.0573 1.0594 1.0433 1.0703 2.0024 1.1890 1.0653 1.0521 1.0840 1.0776 1.0797 6.6656 8.3774 7.6133 8.8085 1.0735 1.0743 1.0594 1.0380 1.0589 1.0417 1.0642 1.0651 1.0356 1.0611 1.0890 1.0993 1.1010 1.0982 1.1000 1.0975 1.1005 1.1030 1.0994 1.0981 1.0987 1.1036 1.0860 1.0906 1.0963 1.0972 1.0657
irintensity: 0.0586 1.3227 0.8642 0.1008 0.0551 3.1983 0.4370 1.1859 1.4296 1.7699 4.4669 2.6647 1.3569 0.0330 1.5940 4.5168 2.2411 0.5604 0.9930 0.9434 1.8878 83.4641 26.8468 1.4177 3.0348 14.6594 3.1542 8.6592 1.7213 3.6968 1.0317 4.9317 4.7343 2.9509 4.3047 4.2484 1.4943 13.7779 8.0991 21.0280 20.2573 45.4028 12.3943 21.4475 1.3208 44.2361 12.9304 5.1311 3.8868 16.4150 17.4764 2.8985 10.8649 1.4945 3.6019 1.9786 3.1549 3.5484 9.5262 0.6554 9.9841 19.2237 233.0562 1.0190 97.1325 27.8191 1.6068 30.1658 3.5090 6.0921 26.4760 4.0556 31.7810 14.4301 16.4198 37.6043 14.6798 174.5387 138.5986 1.4048 1.1488 5.7859 13.5547 4.9115 7.2992 2.1634 3.7336 43.1348 2.2969 4.5477 12.3199 6.8612 30.4541 8.4696 19.2879 23.3566 3.1467 0.8051 18.7958 6.8350 5.4212 7.2680 4.9104 42.6766 7.3387 5.0503 3.3939 27.1051 12.2984 10.3204 31.1766 48.0895 181.4065 200.9844 12.6588 51.5305 3.8038 13.9237 66.1954 35.0024 35.3039 51.1451 26.0859 10.7463 50.7531 5.7772 23.1087 2.1952 41.3418 90.7326 41.2687 5.6260 34.1610 30.5769 30.7105 40.7671 4.5343 14.0662 18.1081 14.4019 7.3479
temp: 298.150 k
press: 1.00000 atm
elementType: 8 8 8 7 6 6 6 6 6 6 6 6 6 6 6 6 6 6 6 6 6 6 1 1 1 1 1 1 1 1 1 1 1 1 1 1 1 1 1 1 1 1 1 1 1 1 1 1 1
symmnumber: 1
zpe: 1086472.9 jmol-1
zpe.correction: 0.413816 hartree
zpe.thermalcorrener: 0.438778 hartree
zpe.thermalcorrenthalpy: 0.439722 hartree
zpe.thermalcorrgfe: 0.356768 hartree
zpe.sumelectzpe: -980.827634 hartree
zpe.sumelectthermal: -980.802672 hartree
zpe.sumelectthermalent: -980.801728 hartree
zpe.sumelectthermalfe: -980.884681 hartree
dipole: 3.1322 0.9942 1.6296
dipole: 3.6681
quadrupole: -110.7301 -122.5898 -136.8224
quadrupole: 0.6303 -6.3135 -5.4714
quadrupole: 12.6507 0.7909 -13.4416 0.6303 -6.3135 -5.4714
hfenergy: -981.2414494 hartree
pointgroup: C01 [X(C18H27N1O3)]
dipole: -1.2133459 0.4248843 -0.6556734 debye
polarizability: 285.1446612|7.0128293|237.5638227|-10.5003742|-1.923824|142.1631789 unknown
InChI: InChI=1S/C18H27NO3/c1-4-22-17(20)15-11-7-8-12-16(15)19-14-10-6-5-9-13-18(2,3)21/h7-8,11-12,14,21H,4-6,9-10,13H2,1-3H3
charge 0 multiplicity 1
49 atoms
O  -3.825699 1.433779 0.155336
O  0.793297 2.154317 0.152214
O  0.402398 0.046012 1.045538
N  2.406073 -1.917124 0.26973
C  -4.734839 0.377413 -0.393548
C  -3.776346 -0.694424 -0.965882
C  -2.904819 -1.427947 0.07837
C  -1.723859 -2.179791 -0.575688
C  -0.849774 -2.928681 0.458041
C  -5.588342 0.9994 -1.521334
C  -5.62804 -0.162303 0.745295
C  0.514232 -3.439846 -0.107961
C  1.402956 -2.278364 -0.472021
C  3.154639 -0.741493 0.02945
C  2.605577 0.588022 0.083243
C  4.544335 -0.900689 -0.235734
C  3.465572 1.696536 -0.161834
C  5.369914 0.20969 -0.483621
C  4.829708 1.520147 -0.451344
C  1.186833 0.847721 0.475049
C  -0.597589 2.53108 0.559042
C  -0.840712 3.938709 0.024656
H  -4.375281 -1.425948 -1.544728
H  -3.11269 -0.179278 -1.689341
H  -2.495138 -0.687459 0.790938
H  -3.522005 -2.14078 0.662616
H  -2.097295 -2.892991 -1.341705
H  -1.108806 -1.431707 -1.113497
H  -1.409086 -3.799464 0.85477
H  -0.637423 -2.254087 1.306774
H  -6.251003 0.244135 -1.983037
H  -6.227772 1.816257 -1.13378
H  -4.934351 1.417542 -2.306883
H  -6.238547 -1.017125 0.40035
H  -6.322387 0.621793 1.105746
H  -5.0126 -0.495803 1.597467
H  0.327106 -4.067457 -1.002798
H  1.027209 -4.053354 0.653504
H  -4.386078 2.130086 0.585277
H  1.128518 -1.70168 -1.380756
H  4.949352 -1.917441 -0.244003
H  3.033195 2.699364 -0.112534
H  6.434049 0.056805 -0.696026
H  5.469732 2.389067 -0.635724
H  -1.313059 1.798778 0.14752
H  -0.656038 2.480851 1.662138
H  -1.860384 4.265448 0.298888
H  -0.757716 3.960099 -1.075554
H  -0.117516 4.659182 0.444881
