program: Gaussian 09
title: 000105453
version: EM64L-G09RevD.01
frameworkgroup: C1[X(C12H12F11NO4S)]
method: RPBEPBE
basis: SDD
operation: Freq
keyword: #p
keyword: freq=noraman
keyword: PBEPBE/SDD
title: #p freq=noraman PBEPBE/SDD
converged: YES YES NO NO
title: Mulliken charges:
elementType: S F F F F F F F F F F F O O O O N C C C C C C C C C C C C H H H H H H H H H H H H
charge: 1.034043 -0.136760 -0.104218 -0.118395 -0.138003 -0.131861 -0.123524 -0.126896 -0.122036 -0.120274 -0.126455 -0.120881 -0.484149 -0.491806 -0.260966 -0.268590 -0.348192 0.055929 0.339635 0.243699 0.224555 -0.310985 -0.609861 0.384307 -0.309362 0.200002 0.361196 -0.756475 -0.625733 0.231942 0.274011 0.272687 0.296797 0.229155 0.240647 0.247827 0.238656 0.259553 0.214964 0.232526 0.253293
chargesum: 0.00000
title: Mulliken charges with hydrogens summed into heavy atoms:
elementType: S F F F F F F F F F F F O O O O N C C C C C C C C C C C C
charge: 1.034043 -0.136760 -0.104218 -0.118395 -0.138003 -0.131861 -0.123524 -0.126896 -0.122036 -0.120274 -0.126455 -0.120881 -0.484149 -0.491806 -0.260966 -0.268590 -0.348192 0.055929 0.339635 0.243699 0.224555 0.194967 0.188778 0.384307 0.179111 0.200002 0.361196 -0.043303 -0.139913
polarizability: 2.49231213e+02 3.54205409e+00 1.66506277e+02 1.16006945e+01 -3.28561068e+00 1.75583196e+02
1716.lowfreq: -17.7358 -6.7518 -4.0208 -0.6467 -0.0006 0.0005 9.1948 15.7903 17.3707
frequency: -1.3776 14.2358 16.9244 27.1444 34.5018 44.0391 47.3549 53.3205 59.0894 71.5217 78.2737 97.3070 108.3400 111.9003 140.1031 150.3879 159.5718 169.7629 191.4799 196.4383 200.1426 203.0603 207.8794 212.7383 222.1370 225.1011 229.4320 236.0738 261.3268 261.7786 293.5223 294.7084 296.7017 322.8390 328.7918 336.2472 344.7285 361.0766 366.0254 372.4299 387.7148 393.3979 400.5739 441.1936 453.5032 459.1068 485.1399 490.2202 511.1724 524.8275 541.7198 569.6335 572.7891 586.1292 607.9278 629.4749 640.1143 664.9993 757.7053 780.8954 811.2699 821.9928 836.1416 859.1985 939.6281 954.7877 968.8289 981.6351 991.5842 1004.4164 1008.8831 1014.1737 1019.2132 1026.4856 1028.7643 1047.7170 1058.2053 1060.6880 1066.4430 1068.1482 1084.9168 1097.8238 1099.6406 1113.7097 1136.7715 1156.8991 1194.7964 1197.7544 1206.0924 1251.4128 1286.0784 1289.7934 1359.4700 1365.5207 1401.2186 1417.8578 1424.2106 1446.3449 1456.1141 1458.7647 1459.9554 1475.7673 1481.7200 1611.8800 1652.2562 2962.1337 2962.7481 2989.0809 3031.4120 3060.6788 3061.6330 3073.5015 3094.8371 3099.6145 3105.6039 3106.6416 3218.2550
redmass: 9.2991 7.1528 6.2507 11.7177 10.1187 5.0036 5.7620 14.4861 13.1393 7.3738 9.0477 6.1124 6.7071 6.7535 10.8602 5.9040 11.3591 16.7773 17.0654 1.1421 1.5868 5.3022 4.9803 14.6333 4.4432 18.0847 12.7850 2.7840 11.7706 4.0293 12.0862 8.6354 13.2386 18.6753 18.6679 18.4754 2.8564 4.6690 5.3513 3.0866 7.5961 8.7993 4.8057 12.9346 6.0562 8.4910 16.4975 5.5576 9.8999 13.6219 16.8521 3.5145 3.4264 15.2651 13.9635 1.5399 17.1005 16.6323 5.0660 2.1158 5.9617 3.9776 14.6425 3.1168 1.9310 10.8412 4.6756 3.4788 1.3221 3.2888 12.3468 1.3921 13.2489 13.0824 13.2831 12.8528 1.4975 13.1158 12.8072 2.0760 11.6848 1.6653 2.8949 11.1805 12.4108 2.0997 11.2893 2.6708 12.1977 1.2529 1.2949 3.2494 1.3207 1.2202 1.1625 1.2553 1.1282 1.0775 1.0943 1.0439 1.0512 1.0602 1.0473 9.6079 5.0470 1.0584 1.0399 1.0365 1.0590 1.1006 1.0973 1.0972 1.0983 1.1007 1.1071 1.0624 1.1157
irintensity: 0.2055 0.4894 0.4166 1.0114 0.8693 0.9726 0.2092 0.6531 0.3750 1.0372 0.4023 1.6594 3.6140 6.2118 0.7385 1.9641 2.5557 0.6762 6.0437 0.2407 2.0019 0.9577 0.3059 0.3335 0.9752 0.0307 0.2886 3.0038 6.9719 3.1472 2.3668 1.7384 2.0784 0.3150 0.4603 0.3372 16.4237 4.2554 5.7809 11.2403 52.6399 111.5763 6.6293 2.9442 23.7357 2.1267 6.0513 28.4553 15.5429 5.5582 0.4782 36.0776 4.0910 23.4600 47.3226 17.2995 6.9487 3.7714 9.8733 9.5867 13.1962 85.9966 57.1491 12.6934 3.5156 56.3858 20.2522 27.0094 57.3560 42.9877 6.8816 15.0536 8.7397 5.4645 74.6778 64.5946 6.8784 171.6202 134.7698 0.7237 421.8886 135.6988 333.5003 95.4052 18.1394 12.7224 145.2113 10.8486 48.5413 22.7108 4.8189 77.1161 7.3775 3.2488 23.5457 13.4859 28.6661 13.1652 25.2626 11.7504 13.5765 35.7000 32.1061 126.1059 2.6404 17.9351 50.7991 13.6560 35.3489 11.6018 2.5614 11.4868 2.7621 21.7585 5.1774 3.8047 4.9188
temp: 298.150 k
press: 1.00000 atm
elementType: 16 9 9 9 9 9 9 9 9 9 9 9 8 8 8 8 7 6 6 6 6 6 6 6 6 6 6 6 6 1 1 1 1 1 1 1 1 1 1 1 1
symmnumber: 1
zpe: 644235.7 jmol-1
zpe.correction: 0.245376 hartree
zpe.thermalcorrener: 0.276810 hartree
zpe.thermalcorrenthalpy: 0.277754 hartree
zpe.thermalcorrgfe: 0.180050 hartree
zpe.sumelectzpe: -2313.932647 hartree
zpe.sumelectthermal: -2313.901214 hartree
zpe.sumelectthermalent: -2313.900270 hartree
zpe.sumelectthermalfe: -2313.997974 hartree
dipole: -1.6392 -0.6581 3.7552
dipole: 4.1499
quadrupole: -173.2962 -173.6392 -172.4180
quadrupole: -5.1483 -3.8754 -4.4563
quadrupole: -0.1784 -0.5214 0.6998 -5.1483 -3.8754 -4.4563
hfenergy: -2314.1780239 hartree
pointgroup: C01[X(C12H12F11N1O4S1)]
dipole: -0.6695334 -0.826107 1.2389222 debye
polarizability: 248.5300388|-0.2398428|170.263385|14.2217634|-5.4195328|172.5272619 unknown
InChI: InChI=1S/C7H12NO4S.C5F11/c1-6(2)7(9)12-5-4-8(3)13(10)11;6-1(7)2(8,9)3(10,11)4(12,13)5(14,15)16/h1,4-5H2,2-3H3;
charge 0 multiplicity 1
41 atoms
S  -1.397476 -0.094703 -1.160158
F  0.382571 -1.927933 0.099002
F  0.967373 -1.486146 -2.065275
F  1.537067 1.260959 -1.197594
F  1.252289 0.498309 0.958269
F  3.168875 -1.691539 0.099549
F  3.628899 -0.306678 -1.657557
F  3.73232 1.864626 0.500393
F  3.902199 0.082568 1.926433
F  6.368823 0.927135 1.295583
F  5.984748 -0.962895 0.096874
F  5.931375 1.071617 -0.920527
O  -1.675052 -0.329574 -2.733017
O  -1.439578 1.361304 -0.456783
O  -4.640867 0.155435 1.309275
O  -5.770964 -1.240849 -0.187848
N  -2.512146 -1.174461 -0.223867
C  0.587625 -0.909671 -0.854901
C  1.622664 0.128152 -0.3597
C  3.129238 -0.344683 -0.335635
C  4.083062 0.499387 0.591103
C  -2.473948 -1.009659 1.241278
C  -2.817721 -2.483301 -0.82978
C  5.616784 0.380867 0.251219
C  -3.900536 -1.008228 1.827573
C  -5.506466 -0.082582 0.221912
C  -6.039682 1.206502 -0.32143
C  -5.46734 2.508016 0.199027
C  -7.001589 1.122073 -1.282596
H  -1.884689 -1.816971 1.725195
H  -2.003935 -0.036387 1.470236
H  -2.681085 -2.419453 -1.922574
H  -3.888047 -2.686882 -0.644866
H  -2.189216 -3.297116 -0.41792
H  -3.841636 -0.869145 2.919654
H  -4.450408 -1.93544 1.59054
H  -5.623858 2.606515 1.287879
H  -4.375413 2.549887 0.03227
H  -5.936376 3.368628 -0.306647
H  -7.430621 2.021338 -1.737084
H  -7.364565 0.147877 -1.627704
