program: Gaussian 09
title: 000105432
version: EM64L-G09RevD.01
frameworkgroup: C1[X(C11H16N2O4)]
method: RPBEPBE
basis: SDD
operation: Freq
keyword: #p
keyword: freq=noraman
keyword: PBEPBE/SDD
title: #p freq=noraman PBEPBE/SDD
converged: YES YES NO NO
title: Mulliken charges:
elementType: O O O O N N C C C C C C C C C C C H H H H H H H H H H H H H H H H
charge: -0.270343 -0.209925 -0.240835 -0.186722 -0.546030 0.015256 -0.574616 -0.095343 0.445831 0.190759 -0.525679 -0.693446 0.209704 -0.532059 0.267712 -0.537696 -0.538077 0.238577 0.202267 0.216304 0.254951 0.237736 0.205243 0.224850 0.301578 0.263398 0.264572 0.230171 0.229228 0.244319 0.224405 0.259928 0.223985
chargesum: 0.00000
title: Mulliken charges with hydrogens summed into heavy atoms:
elementType: O O O O N N C C C C C C C C C C C
charge: -0.270343 -0.209925 -0.240835 -0.186722 -0.018061 0.015256 -0.133772 0.120961 0.445831 0.190759 -0.270729 -0.025616 0.209704 -0.230481 0.267712 0.166022 0.170241
polarizability: 2.41957556e+02 6.24343359e+00 1.87548174e+02 1.09486669e+01 5.12658122e+00 9.20415893e+01
1716.lowfreq: -9.9965 -5.4845 0.0004 0.0005 0.0007 6.2704 20.7717 36.9020 42.7253
frequency: 20.7371 36.4593 42.6338 55.7692 73.4607 110.3049 132.6517 165.5588 173.3651 191.7305 211.1934 228.5730 249.3826 258.2386 261.0516 274.6896 283.4837 314.0313 377.0307 380.6414 387.8240 417.9625 438.5926 457.8167 468.9940 504.2545 582.7072 611.8602 627.9883 635.8193 693.7774 713.9031 727.8668 745.3069 817.8042 823.8154 866.3314 886.6482 903.2382 935.6361 939.9067 987.2496 994.8794 1041.7123 1077.4858 1106.7607 1114.3518 1123.2596 1144.2584 1153.4329 1162.2694 1180.5292 1191.9463 1196.4233 1237.0714 1256.3339 1280.9698 1287.0939 1317.7243 1340.6980 1364.9992 1381.1291 1390.5385 1415.5286 1438.5844 1441.3964 1458.7212 1465.3066 1467.0408 1470.8322 1471.2390 1473.6004 1476.3974 1495.6989 1570.1462 1616.5932 1636.9567 2965.5704 2966.2666 2974.5262 2985.2290 2986.2216 3056.1817 3059.8923 3068.0279 3081.1561 3102.1567 3128.5390 3135.7680 3153.7773 3185.9255 3443.7733 3572.8118
redmass: 11.2984 3.2898 5.0786 3.3441 3.3843 4.0565 4.2195 4.2250 3.0426 3.2654 1.8235 1.6313 1.3639 1.3088 1.2892 1.8286 3.3773 3.2634 5.1191 3.4520 4.0750 4.3198 2.3805 2.8313 5.6539 4.5488 1.6576 4.5948 4.4596 5.6558 6.7660 7.7616 3.8811 7.2083 3.3269 3.0507 1.8644 1.4895 1.4410 1.9478 6.1537 2.8021 1.9430 4.5472 1.8089 1.2565 1.2628 2.1299 2.1852 1.4247 1.5333 1.9080 3.9107 3.5540 1.3795 1.6387 2.6709 1.5687 1.2403 7.3196 1.4396 7.7374 1.2697 2.8343 1.1906 1.5482 1.1242 1.1422 1.0500 1.0561 1.0498 1.0757 1.0547 2.2685 8.9606 6.8429 1.1012 1.0326 1.0328 1.0837 1.0461 1.0547 1.1042 1.1045 1.0992 1.0972 1.1006 1.1002 1.0996 1.0898 1.0899 1.0444 1.0977
irintensity: 0.3778 1.4841 1.7457 0.5600 4.2663 0.3848 2.7337 5.6633 7.6933 1.8297 0.9639 0.7688 11.0492 3.8732 33.4908 1.2523 6.2531 0.4250 4.3194 5.8965 7.7962 3.2216 7.3233 9.6646 0.3808 6.2120 342.9891 74.0498 1.0104 18.9342 45.2779 13.1392 1.2354 11.4876 9.4052 15.2369 12.4843 10.0626 30.3673 22.5256 12.0715 75.8868 48.7459 18.2688 42.8579 0.0749 0.3273 16.0483 51.6164 23.7860 5.4271 282.4112 211.0694 298.5926 2.0496 43.7747 27.1654 24.6243 15.2219 14.7199 5.0525 151.2142 21.4025 40.8925 7.4100 1.9852 5.5826 153.4795 14.8884 9.8286 12.8689 44.4682 9.9828 138.1181 78.2511 40.2189 45.5544 94.9096 13.0686 19.2601 42.1725 25.4510 38.0423 41.4274 8.2599 38.1274 33.3470 19.7396 14.9720 6.8106 7.5898 6.2477 0.3581
temp: 298.150 k
press: 1.00000 atm
elementType: 8 8 8 8 7 7 6 6 6 6 6 6 6 6 6 6 6 1 1 1 1 1 1 1 1 1 1 1 1 1 1 1 1
symmnumber: 1
zpe: 688594.6 jmol-1
zpe.correction: 0.262272 hartree
zpe.thermalcorrener: 0.280502 hartree
zpe.thermalcorrenthalpy: 0.281446 hartree
zpe.thermalcorrgfe: 0.214822 hartree
zpe.sumelectzpe: -837.741178 hartree
zpe.sumelectthermal: -837.722948 hartree
zpe.sumelectthermalent: -837.722004 hartree
zpe.sumelectthermalfe: -837.788628 hartree
dipole: -6.1369 -1.5849 -2.1816
dipole: 6.7032
quadrupole: -127.0569 -79.7918 -102.0843
quadrupole: -9.8991 2.2875 3.0884
quadrupole: -24.0793 23.1859 0.8934 -9.8991 2.2875 3.0884
hfenergy: -838.0034502 hartree
pointgroup: C01 [X(C11H16N2O4)]
dipole: 2.375977 -0.6822973 0.9188183 debye
polarizability: 240.8283585|-7.1502561|187.9315653|16.2657469|-1.0555233|92.7873958 unknown
InChI: InChI=1S/C11H16N2O4/c1-7(12)4-8-5-11(17-3)9(13(14)15)6-10(8)16-2/h5-7H,4,12H2,1-3H3
charge 0 multiplicity 1
33 atoms
O  1.514368 2.142262 0.653954
O  -2.182736 -2.05333 -0.149083
O  -3.335483 2.000461 -0.500791
O  -3.981147 -0.181277 -0.599849
N  4.671932 -1.399072 -0.029719
N  -3.083695 0.72498 -0.411811
C  2.469025 -0.518462 0.885201
C  3.306677 -0.968591 -0.379257
C  1.020715 -0.207582 0.575981
C  0.556025 1.138015 0.44172
C  0.094039 -1.25036 0.375055
C  3.386258 0.143688 -1.441632
C  -1.269941 -1.024852 0.045926
C  -0.785727 1.396166 0.1220
C  -1.70081 0.333084 -0.079938
C  1.063405 3.534164 0.548598
C  -1.705268 -3.437026 -0.013366
H  2.962352 0.365401 1.325946
H  2.520417 -1.344028 1.622571
H  2.787589 -1.842491 -0.823477
H  0.452993 -2.277566 0.492338
H  3.952086 -0.215971 -2.317841
H  3.897036 1.036775 -1.033334
H  2.379957 0.456198 -1.768128
H  -1.18573 2.406817 0.016284
H  4.72327 -2.174464 0.63927
H  5.297217 -0.627233 0.226212
H  0.273783 3.75621 1.291921
H  0.688193 3.757362 -0.468533
H  1.955492 4.141874 0.758768
H  -0.912048 -3.663233 -0.751231
H  -2.592637 -4.051859 -0.219166
H  -1.339508 -3.637256 1.011809
