program: Gaussian 09
title: 000105359
version: EM64L-G09RevD.01
frameworkgroup: C1[X(C16H14N2O8)]
method: RPBEPBE
basis: SDD
operation: Freq
keyword: #p
keyword: freq=noraman
keyword: PBEPBE/SDD
title: #p freq=noraman PBEPBE/SDD
converged: YES YES NO NO
title: Mulliken charges:
elementType: O O O O O O O O N N C C C C C C C C C C C C C C C C H H H H H H H H H H H H H H
charge: -0.310421 -0.310377 -0.380875 -0.381048 -0.383393 -0.383335 -0.483209 -0.483174 -0.069441 -0.069454 0.133827 0.133712 0.072076 0.071469 0.033242 0.033268 0.290605 0.290693 0.072898 0.072862 -0.316227 -0.316247 -0.383054 -0.383074 -0.409086 -0.409066 0.287618 0.287568 0.262750 0.262743 0.255856 0.231955 0.255851 0.231944 0.387860 0.388020 0.351201 0.351204 0.356132 0.356125
chargesum: 0.00000
title: Mulliken charges with hydrogens summed into heavy atoms:
elementType: O O O O O O O O N N C C C C C C C C C C C C C C C C
charge: -0.310421 -0.310377 0.006986 0.006972 -0.032192 -0.032131 -0.127077 -0.127048 -0.069441 -0.069454 0.133827 0.133712 0.072076 0.071469 0.033242 0.033268 0.290605 0.290693 0.072898 0.072862 -0.028609 -0.028679 -0.120304 -0.120331 0.078724 0.078728
polarizability: 4.54732626e+02 3.01216722e+01 2.79325958e+02 -3.18548535e-03 2.00824855e-02 1.17959273e+02
1716.lowfreq: -2.8856 -0.0004 0.0003 0.0005 6.6040 7.0491 23.6577 51.5497 53.5810
frequency: 23.6209 51.5412 53.5798 67.8434 78.7286 95.6953 95.7949 106.5408 125.7040 131.6399 131.9828 149.0431 163.4729 175.4679 177.3703 203.2297 212.4369 253.7059 279.2430 284.2518 316.8339 335.5146 347.8552 377.0104 397.3195 407.5213 408.4163 420.1343 424.5876 431.9516 436.7396 453.2875 461.7632 477.7219 491.0364 505.8242 532.3701 552.0916 569.0040 580.3107 585.6854 604.8314 661.0509 667.5894 700.5677 717.9137 743.6861 778.3363 781.0991 784.2529 836.8691 838.0434 841.0080 845.2626 869.7413 873.9651 928.7519 929.4305 959.2302 963.3670 978.3373 1013.0905 1014.7483 1029.9494 1037.7560 1088.6862 1135.1188 1147.4199 1169.2714 1170.1890 1188.3442 1203.8689 1235.9168 1237.4693 1254.7933 1262.5468 1281.8471 1291.6662 1304.5417 1314.5729 1320.5325 1350.3323 1364.1674 1367.9585 1380.2452 1382.0938 1392.8608 1408.7439 1418.1111 1419.4004 1446.0158 1446.2291 1467.6387 1473.1166 1521.3012 1531.3217 1585.0092 1589.8201 1595.9114 1621.5928 2483.2835 2491.3536 3008.1633 3008.2526 3076.8650 3076.8763 3152.6508 3152.6892 3177.6752 3177.7339 3356.0465 3356.0699 3576.7908 3576.7941
redmass: 6.6794 6.7007 6.1504 6.3117 6.3769 4.7851 5.3945 7.1310 5.2379 1.4669 1.4228 4.2651 3.7775 7.1423 4.0057 7.6369 4.8153 4.3876 7.9282 5.0827 4.0738 4.1597 3.8794 5.9757 3.5947 1.3834 1.2255 9.3877 7.7254 6.1762 6.6284 5.3044 7.0465 6.5541 5.1315 5.2208 6.5182 4.5927 4.9748 5.9468 4.5567 4.3433 6.2222 6.7307 6.3398 7.0025 8.2597 10.9884 7.9872 7.2916 1.5489 1.5933 7.7994 7.1113 6.3743 6.1438 4.6060 3.5177 1.6112 1.3336 3.1077 1.0615 1.0611 1.7474 1.7108 2.8690 3.3632 1.9631 1.3481 3.1288 1.5692 1.5999 1.3078 1.2874 1.8616 1.6954 4.3550 3.4362 2.7159 1.5360 1.5532 4.0606 1.6818 2.0037 1.5612 1.3333 3.8855 6.8387 7.1331 5.9254 1.1060 1.1127 2.9205 2.2532 6.2895 8.2972 2.4708 2.6927 6.7173 7.0051 1.0744 1.0738 1.0555 1.0555 1.1105 1.1105 1.0894 1.0894 1.0967 1.0967 1.0672 1.0672 1.0671 1.0671
irintensity: 3.7686 4.5135 0.0299 4.5478 0.0137 11.4383 8.4411 0.0014 35.8412 100.7663 111.0534 0.4140 24.5670 17.1577 22.2232 0.5629 3.7217 0.6033 19.2544 1.9745 6.1444 20.1447 1.4043 0.1030 41.4978 99.6162 1.7861 0.6704 0.8758 4.9692 5.9010 3.4889 15.4584 20.9009 0.0008 1.2386 10.1459 30.2715 223.9754 9.3638 35.5493 23.5957 13.8301 1.0200 57.8875 0.1882 1.0953 0.1224 10.8738 7.6059 4.4865 66.5390 413.7706 95.8173 10.2387 22.0646 28.5219 8.6557 0.1256 0.2525 3.7683 4.6870 221.7111 47.4799 4.9204 190.1408 56.1647 88.9359 7.6462 23.8959 75.2304 17.2785 241.7473 0.8138 427.8243 6.4307 119.1945 0.2620 280.5255 34.1387 169.8956 0.1291 186.6831 17.6785 0.0014 44.9167 0.1511 43.6441 333.4174 0.2419 18.9646 5.4326 27.0936 462.1247 3.8426 134.4831 0.3281 93.1164 59.3873 0.3287 0.4816 295.1575 42.5734 46.5603 28.4375 13.8430 0.1122 0.2647 7.0303 0.3360 1.2099 0.8016 0.6528 6.2903
temp: 298.150 k
press: 1.00000 atm
elementType: 8 8 8 8 8 8 8 8 7 7 6 6 6 6 6 6 6 6 6 6 6 6 6 6 6 6 1 1 1 1 1 1 1 1 1 1 1 1 1 1
symmnumber: 1
zpe: 740564.1 jmol-1
zpe.correction: 0.282066 hartree
zpe.thermalcorrener: 0.305924 hartree
zpe.thermalcorrenthalpy: 0.306868 hartree
zpe.thermalcorrgfe: 0.229093 hartree
zpe.sumelectzpe: -1327.405956 hartree
zpe.sumelectthermal: -1327.382098 hartree
zpe.sumelectthermalent: -1327.381154 hartree
zpe.sumelectthermalfe: -1327.458929 hartree
dipole: -0.0013 0.0041 1.3949
dipole: 1.3949
quadrupole: -78.7640 -172.3651 -144.6110
quadrupole: -4.4091 0.0009 0.0018
quadrupole: 53.1494 -40.4518 -12.6976 -4.4091 0.0009 0.0018
hfenergy: -1327.6880219 hartree
pointgroup: C01 [X(C16H14N2O8)]
dipole: 0.0004946 -0.0016008 0.5487815 debye
polarizability: 455.5584995|27.6001695|278.5000845|0.0028979|-0.020126|117.9592728 unknown
InChI: InChI=1S/C16H14N2O8/c19-5-17(25)7-1-3-9(21)13-11(7)15(23)14-10(22)4-2-8(18(26)6-20)12(14)16(13)24/h1-4,19-22,25-26H,5-6H2
charge 0 multiplicity 1
40 atoms
O  -1.510041 2.294009 -0.65646
O  1.510426 -2.293722 -0.655948
O  0.503217 3.715831 -0.752971
O  -0.50366 -3.71624 -0.751829
O  -3.405387 1.676647 1.153938
O  3.405048 -1.676822 1.153422
O  -5.870027 0.056977 0.864291
O  5.870052 -0.05723 0.865171
N  -3.754097 0.823847 0.017968
N  3.754254 -0.823561 0.017945
C  -1.476883 -0.113345 -0.338631
C  1.477087 0.113532 -0.338492
C  -0.647539 -1.28126 -0.468503
C  0.647726 1.281318 -0.468913
C  -0.824508 1.202881 -0.475865
C  0.824739 -1.202768 -0.474883
C  -2.892812 -0.272596 -0.220093
C  2.893001 0.272923 -0.220086
C  1.249473 2.580693 -0.594452
C  -1.249443 -2.580682 -0.593795
C  -3.463718 -1.580198 -0.340317
C  3.463805 1.58057 -0.34047
C  2.665471 2.705997 -0.547581
C  -2.665478 -2.705722 -0.547114
C  -5.163062 0.801996 -0.227856
C  5.163287 -0.801694 -0.227499
H  -4.54367 -1.700037 -0.209487
H  4.543748 1.700511 -0.209668
H  3.098273 3.706835 -0.63005
H  -3.098404 -3.706527 -0.629328
H  -5.518754 1.847606 -0.264402
H  -5.344412 0.295962 -1.192693
H  5.518925 -1.847308 -0.264408
H  5.344928 -0.29525 -1.192066
H  -0.503612 3.395123 -0.758473
H  0.503608 -3.396691 -0.757396
H  -3.734343 1.158894 1.950415
H  3.733558 -1.159364 1.950274
H  -6.723043 0.506788 1.087849
H  6.722965 -0.507223 1.08876
