program: Gaussian 09
title: 000105279
version: EM64L-G09RevD.01
frameworkgroup: C1[X(C19H19N5O2S)]
method: RPBEPBE
basis: SDD
operation: Freq
keyword: #p
keyword: freq=noraman
keyword: PBEPBE/SDD
title: #p freq=noraman PBEPBE/SDD
converged: YES YES NO NO
title: Mulliken charges:
elementType: S O O N N N N N C C C C C C C C C C C C C C C C C C C H H H H H H H H H H H H H H H H H H H
charge: 0.274245 -0.238171 -0.254110 -0.189210 -0.058954 0.054026 -0.458595 -0.043643 -0.360742 -0.363200 -0.303660 -0.311041 0.493366 -0.337743 -0.358939 -0.291299 -0.349396 0.118025 -0.356443 0.349353 0.514153 -0.384200 -0.306830 -0.455112 -0.398494 0.222553 -0.781071 0.216826 0.234381 0.230714 0.222482 0.225107 0.199149 0.197847 0.227582 0.223318 0.218111 0.278933 0.257361 0.325000 0.259434 0.220825 0.305219 0.260021 0.259824 0.213002
chargesum: 0.00000
title: Mulliken charges with hydrogens summed into heavy atoms:
elementType: S O O N N N N N C C C C C C C C C C C C C C C C C C C
charge: 0.274245 -0.238171 -0.254110 -0.189210 -0.058954 0.054026 -0.153376 -0.043643 0.090464 0.089996 0.120596 0.114388 0.493366 -0.114426 -0.140829 -0.012366 -0.092035 0.118025 -0.356443 0.349353 0.514153 -0.059201 -0.047397 -0.234287 -0.398494 0.222553 -0.048224
polarizability: 9.45756532e+02 -8.24212683e+00 2.52491993e+02 -8.60129958e+00 4.69527093e+00 1.23950711e+02
1716.lowfreq: -5.5385 -1.4716 0.0012 0.0019 0.0022 4.9906 12.1380 13.8623 26.8400
frequency: 11.4503 13.8039 26.6854 28.8231 39.8171 43.1514 62.6629 63.6161 91.2847 103.7176 117.6904 144.2234 172.0529 192.4354 193.3978 207.9632 239.5241 262.3075 273.5721 289.6888 304.4452 339.5103 358.0850 382.5154 388.1431 409.1676 421.2784 426.9354 443.5540 453.8730 466.1667 478.1377 502.0745 515.9553 526.9942 572.7973 577.5298 600.6687 610.4072 624.3495 629.4704 635.4926 643.1759 675.4418 690.6293 741.9834 744.8410 755.3821 795.9523 811.1844 820.2572 825.8650 826.9276 836.7547 886.6025 910.0432 915.6067 922.9084 925.5293 930.8556 951.1585 968.4938 983.6067 984.7429 996.2609 1014.8131 1022.0927 1039.7149 1040.6345 1051.2751 1055.7052 1080.4476 1102.1477 1121.1141 1131.9583 1169.7032 1174.2086 1199.2989 1205.6600 1230.8510 1234.4520 1249.1754 1258.7192 1263.7477 1282.0289 1290.2925 1307.6919 1312.0665 1335.8185 1344.8555 1350.4104 1359.1024 1369.0900 1374.1647 1386.1073 1389.7723 1406.0645 1434.6898 1447.4064 1448.2728 1449.0560 1454.6455 1457.2354 1461.9100 1464.6447 1472.3391 1496.6408 1505.1644 1545.8678 1562.5349 1613.6320 1620.1621 1623.2672 2943.7084 2946.8496 2957.6590 2962.7178 2995.2925 3081.5403 3087.1095 3090.3963 3096.9624 3098.1773 3104.3495 3118.5245 3150.6214 3151.6866 3170.4962 3174.2930 3174.4277 3191.5836 3534.6234
redmass: 3.9890 6.1226 6.4376 4.4781 2.0057 1.8542 6.5065 3.0212 4.9570 5.3372 7.1679 5.5208 5.0774 6.0709 5.8412 2.7274 3.3249 3.6984 6.2514 5.1288 7.4059 6.5920 4.1815 2.7771 4.1341 4.7453 4.9163 3.5535 3.5198 2.9671 4.2032 6.0116 7.2070 2.7111 4.5450 3.4684 2.7858 5.2748 6.0169 3.2048 5.7701 7.4903 1.2421 3.7336 6.9261 4.0883 4.7139 6.5069 1.7040 2.3669 1.5467 4.7370 1.8504 1.7409 5.8337 3.4864 2.6083 7.5424 1.3660 6.0607 1.3621 1.3623 1.6938 1.9073 1.6367 2.4239 3.2263 1.6299 2.4439 1.9443 5.3518 4.9810 2.1575 1.4578 1.4466 3.0128 1.3843 1.0849 2.0913 2.3578 1.7450 2.4218 1.2909 1.5834 1.3300 2.8991 1.4093 4.7711 1.3348 1.2821 3.4317 1.3628 3.3025 1.4328 2.1330 1.2376 5.4158 6.8403 1.0815 1.0864 1.0451 1.2022 1.6268 1.7296 2.3032 1.4671 2.2297 2.9983 6.2940 5.0829 6.5566 6.7069 4.7888 1.0700 1.0711 1.0664 1.0667 1.0363 1.0925 1.0961 1.0980 1.1005 1.0980 1.0902 1.0899 1.0869 1.0864 1.0952 1.0955 1.0957 1.0937 1.0766
irintensity: 0.3185 1.6410 1.5950 3.2409 0.0821 1.5027 10.6151 1.9204 1.3129 3.2225 0.2984 0.3303 1.0611 0.8755 5.4013 5.1250 3.2984 24.4854 6.7015 4.8610 12.6501 0.7707 12.1298 2.2581 1.9822 4.1690 1.6655 0.8644 12.2291 2.0987 1.8597 2.1677 0.8287 21.4255 8.5191 13.9168 139.4773 2.0280 48.0439 15.8778 0.2727 35.9734 48.4188 2.4815 2.9904 6.1459 0.1300 2.9953 2.8286 8.4334 59.7170 7.1510 44.9623 31.3876 15.0451 129.6466 23.7176 36.5356 32.2544 4.4896 0.2441 2.8539 2.6585 0.6977 65.8652 54.1122 25.7956 15.2919 38.8270 13.0501 115.9826 53.2495 36.8143 5.4932 65.3920 15.2211 261.1826 6.9117 3.4612 14.4961 848.7971 68.7837 41.3619 24.8984 128.7314 38.1071 11.3301 578.6904 5.3901 9.6085 28.9574 25.1498 16.6800 4.5044 133.9762 163.4159 272.1255 40.1549 11.5940 11.4348 15.4404 52.1146 2.4718 48.3964 140.8263 115.9731 300.9600 187.4606 77.7411 289.0503 593.0042 350.5186 122.1828 54.0153 147.7108 23.4982 121.7036 21.0783 16.7419 32.5847 63.9255 18.9207 7.1453 13.1015 34.8006 12.1484 7.7388 16.6512 32.5727 16.0079 14.0339 21.2940
temp: 298.150 k
press: 1.00000 atm
elementType: 16 8 8 7 7 7 7 7 6 6 6 6 6 6 6 6 6 6 6 6 6 6 6 6 6 6 6 1 1 1 1 1 1 1 1 1 1 1 1 1 1 1 1 1 1 1
symmnumber: 1
zpe: 927293.1 jmol-1
zpe.correction: 0.353187 hartree
zpe.thermalcorrener: 0.377583 hartree
zpe.thermalcorrenthalpy: 0.378527 hartree
zpe.thermalcorrgfe: 0.294373 hartree
zpe.sumelectzpe: -1555.713661 hartree
zpe.sumelectthermal: -1555.689265 hartree
zpe.sumelectthermalent: -1555.688321 hartree
zpe.sumelectthermalfe: -1555.772475 hartree
dipole: 2.2657 2.5144 0.1960
dipole: 3.3903
quadrupole: -90.6575 -158.1823 -168.3627
quadrupole: -23.9701 -0.0974 0.3402
quadrupole: 48.4100 -19.1148 -29.2952 -23.9701 -0.0974 0.3402
hfenergy: -1556.0668481 hartree
pointgroup: C01 [X(C19H19N5O2S1)]
dipole: -0.8794317 -0.8526057 0.5279833 debye
polarizability: 945.9435323|0.153775|222.3698729|1.3005594|-54.5780109|153.8858308 unknown
InChI: InChI=1S/C19H19N5O2S/c1-13(25)20-15-4-7-17-18(12-15)27-19(21-17)23-22-14-2-5-16(6-3-14)24-8-10-26-11-9-24/h2-7,12,20H,8-11H2,1H3
charge 0 multiplicity 1
46 atoms
S  2.517598 1.289143 -0.760565
O  -9.201177 0.631102 -0.059167
O  7.765767 1.96508 -1.053781
N  -6.338173 0.137117 -0.13389
N  -0.735837 -0.692782 0.364081
N  2.094187 -1.070351 0.513134
N  7.641748 -0.1053 0.04748
N  0.074904 0.199909 -0.189499
C  -7.311614 -0.970869 0.020412
C  -6.921463 1.318053 -0.808716
C  -8.604546 -0.480298 0.696332
C  -8.238261 1.738296 -0.123448
C  -4.953195 -0.06256 -0.05242
C  -4.030235 0.848538 -0.677675
C  -4.396486 -1.166509 0.676613
C  -2.648936 0.680042 -0.563428
C  -3.011724 -1.332147 0.784527
C  -2.106054 -0.415057 0.176738
C  3.929227 0.310712 -0.217251
C  3.47544 -0.896003 0.428734
C  6.235888 -0.309105 0.140594
C  5.292113 0.619348 -0.368827
C  4.441819 -1.808225 0.926978
C  5.802496 -1.513635 0.78229
C  1.434013 -0.058684 -0.035521
C  8.33525 0.969711 -0.516723
C  9.856433 0.857802 -0.439339
H  -6.879527 -1.788614 0.615272
H  -7.563189 -1.378067 -0.983135
H  -7.11275 1.097199 -1.881392
H  -6.225089 2.169506 -0.747715
H  -9.365363 -1.277548 0.703984
H  -8.390855 -0.15705 1.738051
H  -8.021471 2.106764 0.902721
H  -8.735205 2.533401 -0.702755
H  -4.400508 1.678929 -1.285127
H  -5.044692 -1.885321 1.184459
H  -1.956241 1.373222 -1.050722
H  -2.588182 -2.168377 1.350452
H  5.643968 1.530322 -0.854591
H  4.10377 -2.725502 1.416892
H  6.551335 -2.217197 1.167827
H  8.215578 -0.848631 0.451397
H  10.252417 1.736732 0.097883
H  10.269647 0.888432 -1.462258
H  10.217074 -0.057328 0.062092
