program: Gaussian 09
title: 000105118
version: EM64L-G09RevD.01
frameworkgroup: C1[X(C18H14O3)]
method: RPBEPBE
basis: SDD
operation: Freq
keyword: #pfreq=noraman
keyword: PBEPBE/SDD
title: #p freq=noraman PBEPBE/SDD
converged: NO YES NO NO
title: Mulliken charges:
elementType: O O O C C C C C C C C C C C C C C C C C C H H H H H H H H H H H H H H
charge: -0.227181 -0.145518 -0.145456 0.168563 -0.482150 -0.441947 0.167033 0.124807 -0.575324 0.441618 0.443778 0.079863 -0.399698 -0.012611 -0.474980 -0.189129 -0.170642 0.321910 -0.730876 -0.325455 -0.778101 0.246496 0.262191 0.222514 0.220050 0.219615 0.217438 0.241627 0.273812 0.226898 0.217929 0.278441 0.251920 0.219536 0.253031
chargesum: 0.00000
title: Mulliken charges with hydrogens summed into heavy atoms:
elementType: O O O C C C C C C C C C C C C C C C C C C
charge: -0.227181 -0.145518 -0.145456 0.168563 0.026537 0.000618 0.167033 0.124807 -0.138271 0.441618 0.443778 0.079863 -0.158071 -0.012611 -0.201168 -0.189129 -0.170642 0.321910 -0.286049 -0.047015 -0.053614
polarizability: 3.73924550e+02 -2.19813630e+01 2.25934340e+02 2.06840836e+00 -3.18898100e+00 9.57779381e+01
1716.lowfreq: -7.4759 -5.7196 -3.7782 -0.0006 0.0006 0.0008 33.7336 46.4506 61.2793
frequency: 33.7268 46.4460 61.2778 95.0922 112.3519 120.4453 144.2054 167.4949 207.6817 216.7070 255.2530 263.7742 277.3974 308.7938 340.3112 358.6362 383.9128 392.1912 418.4866 431.4571 440.5513 465.8685 486.3485 522.7211 549.1805 557.5229 590.1656 607.0801 644.9112 669.9849 686.6542 693.1585 698.6832 740.2291 752.3637 761.4284 823.5576 849.4760 860.7631 866.8565 881.0231 899.7420 913.1088 930.8044 943.1144 980.4657 986.3116 999.3009 1016.0780 1029.6483 1044.3211 1061.1413 1075.9012 1129.7430 1135.5477 1157.6852 1187.3632 1191.4629 1201.2041 1212.8658 1250.6980 1257.4053 1306.5086 1322.6576 1327.5506 1338.5528 1346.4519 1356.4513 1399.1089 1408.4371 1418.6781 1431.3483 1436.7963 1458.1201 1462.5401 1467.3951 1474.6694 1475.5701 1530.9277 1553.5023 1568.2200 1576.1928 1605.2429 1614.6633 1636.4597 2970.3447 2982.2753 2992.7613 2994.2136 3044.1616 3054.6832 3059.1305 3076.7481 3099.2668 3100.7439 3148.4791 3170.3399 3199.7930 3262.1394
redmass: 6.1636 4.5104 5.1143 1.4166 2.1797 3.2034 3.7806 4.7678 3.2550 4.0882 4.8694 5.3830 2.3797 4.1214 5.0624 8.2059 5.4279 5.5242 4.7369 3.9448 4.3093 2.9112 6.0073 4.7581 4.0445 4.2979 3.6208 3.1911 3.6700 2.4193 6.3049 3.1983 2.2733 7.5122 1.4481 2.9068 5.5704 2.3889 1.7132 2.0314 3.2057 3.3846 3.5034 1.4556 3.2615 2.2681 1.4166 2.0921 3.0470 3.9036 1.4923 1.9619 2.1830 2.5972 1.6644 1.5833 2.0828 1.8247 2.5135 1.8882 1.9802 1.2220 1.7431 1.8053 1.8920 2.8452 4.6824 1.9741 2.8682 1.3654 1.6785 1.7183 1.3849 1.0431 1.6486 1.1354 1.9128 1.1320 6.2382 10.2577 5.4422 7.5747 9.1347 9.4938 4.9889 1.0659 1.0691 1.0611 1.0366 1.0905 1.0974 1.1011 1.0972 1.1007 1.0623 1.0873 1.0969 1.1134 1.1004
irintensity: 0.4352 1.8666 0.1975 1.6418 0.7341 0.7990 0.9254 0.2209 2.1412 4.2918 0.7614 0.1805 0.8072 0.1915 1.7736 1.6007 1.4181 1.5168 6.5618 3.2682 4.0953 0.5876 1.2172 3.1667 0.6474 0.4679 4.5835 6.5521 1.2305 0.9971 6.0784 2.5375 0.4547 1.8239 28.7751 3.0901 0.7565 15.7072 20.6959 2.8952 16.8600 17.5706 15.1827 71.0157 11.6986 9.0813 1.0660 0.5045 4.8069 0.3194 6.3342 1.2513 3.9550 10.8135 7.2823 5.0056 15.6274 10.5582 16.2899 3.8901 0.2624 3.6090 2.2746 10.7041 2.3462 24.2280 58.4691 1.2513 8.5970 21.2389 1.7185 11.0322 20.0332 14.5942 14.2182 21.9991 13.5646 9.1218 32.0241 251.3014 13.6263 55.6397 66.6751 87.8106 22.9576 28.8792 8.0601 41.5402 20.9526 9.2436 55.6246 31.9799 9.7382 25.2658 5.9182 7.3750 5.7360 17.3188 0.3969
temp: 298.150 k
press: 1.00000 atm
elementType: 8 8 8 6 6 6 6 6 6 6 6 6 6 6 6 6 6 6 6 6 6 1 1 1 1 1 1 1 1 1 1 1 1 1 1
symmnumber: 1
zpe: 706150.9 jmol-1
zpe.correction: 0.268959 hartree
zpe.thermalcorrener: 0.286204 hartree
zpe.thermalcorrenthalpy: 0.287148 hartree
zpe.thermalcorrgfe: 0.223836 hartree
zpe.sumelectzpe: -918.510194 hartree
zpe.sumelectthermal: -918.492949 hartree
zpe.sumelectthermalent: -918.492005 hartree
zpe.sumelectthermalfe: -918.555317 hartree
dipole: 1.4147 -4.6311 0.0964
dipole: 4.8433
quadrupole: -98.4021 -129.8595 -122.8123
quadrupole: 11.9769 -0.0523 -0.1141
quadrupole: 18.6225 -12.8348 -5.7876 11.9769 -0.0523 -0.1141
hfenergy: -918.7791529 hartree
pointgroup: C01 [X(C18H14O3)]
dipole: 0.5716092 -1.817163 0.0457974 debye
polarizability: 374.2765064|-20.7467179|225.5520131|2.2397938|-3.7304887|95.8083083 unknown
InChI: InChI=1S/C18H14O3/c1-9-4-3-5-12-11(9)6-7-13-15(12)17(20)16(19)14-10(2)8-21-18(13)14/h6-8H,1,3-5H2,2H3
charge 0 multiplicity 1
35 atoms
O  -2.501499 -2.195273 -0.035805
O  -0.153972 2.754269 -0.249304
O  -2.88331 2.480014 0.104362
C  1.710618 0.455143 -0.010927
C  2.406634 1.811119 0.055774
C  3.908895 1.744071 0.392793
C  2.494379 -0.752833 -0.0285
C  0.277189 0.359669 -0.046031
C  4.601344 0.630898 -0.421681
C  -0.350316 -0.936241 -0.052156
C  3.986654 -0.703725 -0.03649
C  -1.792991 -0.992795 -0.038088
C  1.831023 -2.008939 -0.080555
C  -2.684898 0.078858 0.006555
C  0.434324 -2.111173 -0.075062
C  -0.599495 1.581625 -0.094894
C  -2.170193 1.439643 0.016657
C  -4.036911 -0.463827 0.042113
C  4.76966 -1.762739 0.320951
C  -3.879351 -1.838142 0.012422
C  -5.322158 0.31325 0.096205
H  2.260197 2.324266 -0.91621
H  1.880769 2.464447 0.773764
H  4.369746 2.72624 0.18058
H  4.050914 1.54376 1.472433
H  5.690265 0.619325 -0.240247
H  4.445663 0.826804 -1.502885
H  2.429458 -2.922669 -0.145947
H  -0.058413 -3.087143 -0.103883
H  5.861646 -1.6832 0.294609
H  4.363999 -2.719394 0.667357
H  -4.572516 -2.674204 0.017265
H  -5.405612 0.993055 -0.77015
H  -6.19905 -0.355602 0.106557
H  -5.354295 0.953843 0.99522
