program: Gaussian 09
title: 000105116
version: EM64L-G09RevD.01
frameworkgroup: C1[X(C12H13N5O3)]
method: RPBEPBE
basis: SDD
operation: Freq
keyword: #p
keyword: freq=noraman
keyword: PBEPBE/SDD
title: #p freq=noraman PBEPBE/SDD
converged: NO YES NO NO
title: Mulliken charges:
elementType: O O O N N N N N C C C C C C C C C C C C H H H H H H H H H H H H H
charge: -0.279705 -0.459698 -0.432913 -0.161959 -0.034967 -0.216368 -0.026068 -0.054095 -0.063296 -0.518524 -0.125506 -0.097979 -0.317835 0.102547 -0.229168 -0.054545 0.178876 -0.219802 -0.169867 -0.324515 0.270675 0.244196 0.282365 0.231306 0.260383 0.188795 0.215446 0.327383 0.352281 0.360309 0.253070 0.259546 0.259633
chargesum: 0.00000
title: Mulliken charges with hydrogens summed into heavy atoms:
elementType: O O O N N N N N C C C C C C C C C C C C
charge: -0.279705 -0.107417 -0.072604 -0.161959 -0.034967 -0.216368 -0.026068 -0.054095 0.207379 0.008036 0.105800 0.162404 0.086406 0.102547 0.098214 -0.054545 0.178876 0.033268 0.089680 -0.064882
polarizability: 2.66565609e+02 1.49836956e+01 1.57031021e+02 9.53602123e+00 -1.69746597e+01 1.04578398e+02
1716.lowfreq: -5.8290 -0.0006 -0.0005 -0.0004 5.9711 9.8782 33.0692 38.5093 61.6626
frequency: 32.0579 38.0741 61.4684 96.1502 101.1369 131.3241 143.3784 163.5565 189.3872 231.0209 258.6037 305.2426 308.7399 314.6189 333.3715 345.4767 420.9248 437.0640 465.9419 499.5737 510.4696 544.6906 559.1456 614.8093 621.6242 634.5382 657.5657 686.2638 694.9196 715.7547 716.3679 747.3982 769.4755 798.7288 814.0304 843.1263 850.9593 871.8653 877.4182 878.0663 906.5764 941.0111 955.9587 979.1491 1001.2112 1007.6690 1025.0016 1055.0399 1057.9283 1064.1184 1077.8093 1126.9038 1146.0364 1161.9880 1168.0040 1179.0487 1192.0120 1222.2901 1246.8069 1266.3141 1271.1434 1272.8935 1289.8720 1304.4250 1309.5668 1315.9541 1335.3092 1338.5199 1361.5237 1366.1812 1377.1412 1386.4238 1420.6163 1441.4003 1451.2528 1457.2449 1462.6129 1488.1329 1502.0145 1631.6620 2936.0046 2991.5351 3029.0691 3041.2530 3063.2560 3063.8817 3115.6123 3178.2894 3224.1012 3229.6910 3253.9999 3518.3921 3572.1986
redmass: 6.3292 6.4006 5.5356 4.5574 4.9900 5.1194 4.6101 6.0428 5.9481 4.6220 4.9147 1.9026 2.5991 2.5061 4.3830 4.0328 5.3144 2.9192 7.2133 1.1482 3.2194 5.6772 4.7770 3.3412 6.2724 4.9711 5.3794 6.2279 5.9232 4.6499 1.4684 4.2064 9.7792 4.8575 4.9188 3.0043 1.4403 1.3764 2.3746 2.1729 4.1547 3.4449 2.9976 4.4335 2.5312 3.6605 3.7546 2.7112 1.9791 2.0002 2.7215 2.4326 2.4768 1.2755 1.4478 1.1906 3.1079 1.8245 1.3918 1.8973 1.9500 1.3400 2.8824 6.3791 1.4127 1.3835 1.3118 1.9485 2.3814 1.4622 4.9695 1.2695 1.4194 4.2209 1.1131 4.3381 1.0941 4.4494 9.1147 11.3059 1.0686 1.0855 1.0859 1.0652 1.0940 1.0872 1.1028 1.0933 1.0920 1.1010 1.1069 1.0652 1.0663
irintensity: 3.0175 0.1116 0.6282 5.4161 5.1035 0.7109 2.2810 3.2752 4.4574 1.4188 1.2182 58.6060 59.8960 46.5827 3.5044 23.3025 6.3940 22.8556 1.2979 161.4067 0.4183 2.2611 3.6995 0.3791 2.1111 31.4191 27.7770 16.0216 3.3447 14.5223 41.9123 32.5438 0.4488 22.1355 5.4573 21.7593 30.6675 7.5242 7.2324 16.4718 180.7872 47.6352 10.5134 102.5721 30.0485 50.2055 46.1798 84.8384 3.0283 22.5327 21.7382 8.2836 9.2718 18.1716 50.0108 19.7506 87.9750 116.9423 8.2152 6.5165 75.4395 14.0782 26.0063 221.4235 16.0214 20.8342 6.0896 12.8380 39.5038 4.1712 0.6665 34.1084 10.6504 61.2404 16.9575 0.3000 7.8701 0.8454 19.1350 85.2301 58.6491 49.3339 18.2141 11.6686 43.8792 13.0440 7.6627 1.7306 5.8280 51.3786 1.6821 14.4799 10.4673
temp: 298.150 k
press: 1.00000 atm
elementType: 8 8 8 7 7 7 7 7 6 6 6 6 6 6 6 6 6 6 6 6 1 1 1 1 1 1 1 1 1 1 1 1 1
symmnumber: 1
zpe: 658343.2 jmol-1
zpe.correction: 0.250750 hartree
zpe.thermalcorrener: 0.267115 hartree
zpe.thermalcorrenthalpy: 0.268059 hartree
zpe.thermalcorrgfe: 0.205939 hartree
zpe.sumelectzpe: -963.011297 hartree
zpe.sumelectthermal: -962.994932 hartree
zpe.sumelectthermalent: -962.993988 hartree
zpe.sumelectthermalfe: -963.056108 hartree
dipole: 3.8435 -2.2033 3.6696
dipole: 5.7526
quadrupole: -99.0996 -124.9436 -117.4190
quadrupole: 34.2237 1.0560 -3.8270
quadrupole: 14.7211 -11.1228 -3.5982 34.2237 1.0560 -3.8270
hfenergy: -963.2620469 hartree
pointgroup: C01 [X(C12H13N5O3)]
dipole: 1.4907976 1.3632262 -1.0205032 debye
polarizability: 264.8514259|-10.7874085|161.1715885|-21.2878043|9.0307386|102.1520135 unknown
InChI: InChI=1S/C12H13N5O3/c18-4-8-7(19)3-9(20-8)17-6-14-10-11-13-1-2-16(11)5-15-12(10)17/h1-2,5-9,18-19H,3-4H2
charge 0 multiplicity 1
33 atoms
O  2.454197 0.460701 0.59945
O  3.240724 -2.156366 -1.126814
O  4.723268 1.545993 1.818267
N  0.432128 -0.232019 -0.539968
N  -1.039205 -1.983955 -0.343665
N  -3.356818 0.959098 0.286544
N  -1.10788 1.66393 -0.124822
N  -4.208305 -1.187415 0.327896
C  1.66714 0.549037 -0.65563
C  2.626159 0.096469 -1.784615
C  3.708244 -0.759376 -1.094875
C  3.777348 -0.180313 0.336602
C  4.852425 0.908378 0.512153
C  -0.823133 0.327023 -0.250349
C  0.239623 -1.622098 -0.574987
C  -1.717765 -0.772895 -0.138181
C  -3.083095 -0.468103 0.147743
C  -2.379959 1.947262 0.144533
C  -4.730467 1.064194 0.565985
C  -5.21465 -0.245542 0.583535
H  1.337922 1.596702 -0.756484
H  3.089829 0.985378 -2.244092
H  2.114425 -0.47669 -2.572588
H  4.685513 -0.680979 -1.612755
H  3.903779 -0.963125 1.107529
H  4.769162 1.656402 -0.308186
H  5.864654 0.467453 0.491856
H  1.067144 -2.299179 -0.774909
H  3.889428 -2.73954 -0.658406
H  3.762142 1.772705 1.934506
H  -2.693896 2.986665 0.262603
H  -5.218942 2.021972 0.720745
H  -6.237641 -0.567465 0.767978
