program: Gaussian 09
title: 000105056
version: EM64L-G09RevD.01
frameworkgroup: C1[X(C16H20FNO2)]
method: RPBEPBE
basis: SDD
operation: Freq
keyword: #p
keyword: freq=noraman
keyword: PBEPBE/SDD
title: #p freq=noraman PBEPBE/SDD
converged: NO YES NO NO
title: Mulliken charges:
elementType: F O O N C C C C C C C C C C C C C C C C H H H H H H H H H H H H H H H H H H H H
charge: -0.211870 -0.260822 -0.260706 -0.071077 -0.202779 -0.146107 -0.235927 -0.151679 -0.502293 -0.499743 -0.487431 0.483220 -0.648752 0.251166 -0.385046 -0.357094 -0.390414 -0.401770 0.317336 -0.505052 0.277638 0.230602 0.248564 0.219213 0.202026 0.234469 0.218419 0.238905 0.232940 0.217456 0.236578 0.227029 0.195436 0.228398 0.243819 0.251419 0.250137 0.227317 0.242951 0.243523
chargesum: 0.00000
title: Mulliken charges with hydrogens summed into heavy atoms:
elementType: F O O N C C C C C C C C C C C C C C C C
charge: -0.211870 -0.260822 -0.260706 -0.071077 0.074859 0.084495 0.012637 0.067534 -0.065798 -0.042419 -0.037035 0.483220 0.010291 0.251166 -0.156648 -0.113275 -0.138995 -0.151632 0.317336 0.208739
polarizability: 2.18356718e+02 -6.97471389e+00 1.43930561e+02 3.21605122e+00 -6.16643538e+00 1.62017812e+02
1716.lowfreq: -14.5103 -0.0010 -0.0007 -0.0005 6.6371 10.2458 24.5242 44.6236 53.3574
frequency: 24.2487 44.6082 53.3321 72.0859 82.1556 105.7225 117.1105 148.9978 166.8547 184.2063 194.4158 208.8353 220.3720 265.2669 281.0697 297.7197 325.0694 344.4603 369.1083 382.2633 410.6453 432.6809 484.2698 493.1118 512.6374 569.7507 577.5381 622.8263 630.8869 674.1867 711.7031 730.5171 746.2360 756.7227 778.0845 789.4004 813.4184 815.0401 826.0365 829.1278 870.8044 894.9733 915.9380 941.7073 943.5885 956.7020 966.4417 977.0198 995.5820 1006.4517 1025.4337 1043.5336 1050.7826 1101.7541 1104.0161 1110.8089 1126.2980 1129.6943 1135.0311 1148.6163 1152.9432 1155.9805 1198.4080 1199.7962 1201.2521 1207.9920 1220.3751 1232.9415 1242.2059 1254.6117 1274.5477 1282.1055 1288.6762 1296.6233 1301.5937 1314.6224 1335.3527 1347.4141 1360.2755 1386.3371 1406.9252 1419.4095 1429.8715 1451.0030 1456.5347 1463.3280 1464.9624 1466.7957 1483.0299 1486.9708 1496.4641 1601.8216 1613.0689 1620.4744 2885.3281 2954.0517 2991.3657 2999.1045 3002.1632 3005.6347 3014.2761 3026.8358 3041.7878 3052.5083 3064.2443 3070.1446 3078.1135 3082.5880 3109.1389 3121.5503 3148.0894 3156.5511 3170.7757 3176.9336
redmass: 3.8515 7.0852 4.1088 3.7793 3.9076 1.1581 4.4090 4.4936 3.8615 2.4521 3.6796 1.2738 2.8917 4.4019 2.6415 4.5833 3.6085 5.2627 5.7209 2.2306 2.9457 3.9402 3.5824 5.5902 3.4406 3.7693 3.5060 4.1311 6.3229 5.2578 4.1017 3.9736 3.3708 4.2586 2.9180 2.6281 2.2391 1.6027 2.2424 2.0526 2.6242 2.7575 3.0853 1.4555 3.0094 1.3724 2.1282 3.1109 2.3454 2.8270 2.1201 2.1624 1.9271 1.4010 1.6390 1.2761 1.6480 1.5451 2.5849 1.4578 1.3940 1.5281 1.6097 1.9354 2.0658 1.8223 1.6285 1.7813 1.6760 1.4956 1.4106 1.4275 1.3112 1.3617 1.4432 1.4320 1.4322 1.6585 1.5619 3.9606 2.7678 1.2018 1.1667 1.0507 1.0900 1.0515 1.0687 1.0614 1.0577 1.0805 2.6010 7.4979 6.4143 9.7564 1.0534 1.0807 1.0634 1.0799 1.0610 1.0291 1.0631 1.0760 1.0881 1.1019 1.0912 1.0988 1.1032 1.1005 1.1046 1.0895 1.1050 1.0879 1.0951 1.0968
irintensity: 0.0231 0.3575 2.5265 0.0959 0.3019 0.2421 0.2033 1.0810 2.5078 0.6969 1.4005 1.0406 2.2771 5.2448 0.2486 5.2708 4.6530 1.0618 5.4125 1.9248 0.1429 5.5661 7.5722 11.2578 4.5268 16.6749 6.0896 5.4443 0.9663 14.9611 1.2942 4.9698 4.2793 2.0976 6.4976 32.0862 17.0331 6.1002 9.6613 40.1508 17.3557 3.5203 0.3812 0.7543 31.5536 0.3192 5.6570 23.5959 5.6766 13.8953 9.6125 1.5608 19.5842 14.4813 2.3696 0.1051 23.2830 20.1620 37.0449 18.8407 10.4936 51.3836 28.1625 5.8304 87.8958 8.0862 16.2482 17.2051 30.9615 9.2264 6.0322 7.8921 3.7646 1.6726 7.6008 0.5784 2.0755 15.5019 0.8270 0.7744 1.5814 20.0386 5.4088 11.6068 8.9775 10.1179 8.6979 12.2402 10.9192 25.3431 128.7043 6.3329 7.2373 179.2881 117.8128 19.4250 31.5488 7.1630 29.2794 32.7923 42.6867 42.4380 49.6861 2.5927 5.0375 19.7698 75.6164 28.4091 21.7752 13.6943 13.4152 7.0988 6.8136 3.6185
temp: 298.150 k
press: 1.00000 atm
elementType: 9 8 8 7 6 6 6 6 6 6 6 6 6 6 6 6 6 6 6 6 1 1 1 1 1 1 1 1 1 1 1 1 1 1 1 1 1 1 1 1
symmnumber: 1
zpe: 866119.1 jmol-1
zpe.correction: 0.329887 hartree
zpe.thermalcorrener: 0.348450 hartree
zpe.thermalcorrenthalpy: 0.349394 hartree
zpe.thermalcorrgfe: 0.282576 hartree
zpe.sumelectzpe: -925.225763 hartree
zpe.sumelectthermal: -925.207200 hartree
zpe.sumelectthermalent: -925.206256 hartree
zpe.sumelectthermalfe: -925.273074 hartree
dipole: 3.0102 -1.6310 -1.3678
dipole: 3.6868
quadrupole: -127.5252 -117.8323 -112.1027
quadrupole: -7.2666 -1.9235 -8.5931
quadrupole: -8.3718 1.3211 7.0508 -7.2666 -1.9235 -8.5931
hfenergy: -925.5556502 hartree
pointgroup: C01 [X(C16H20F1N1O2)]
dipole: -1.193977 0.6242133 -0.5372881 debye
polarizability: 217.656835|-8.6078481|145.4204924|-4.9022903|7.9749283|161.2277628 unknown
InChI: InChI=1S/C16H20FNO2/c1-18-12-7-8-14(18)15(16(19)20-2)13(9-12)10-3-5-11(17)6-4-10/h3-6,12-15H,7-9H2,1-2H3
charge 0 multiplicity 1
40 atoms
F  5.467769 0.141582 -0.296702
O  -0.13225 -1.968207 -0.355101
O  -1.183956 -2.424821 1.660883
N  -2.998563 -0.162256 -0.369846
C  -2.492049 0.193768 0.991852
C  -2.534855 1.015528 -1.174308
C  -0.951601 -0.081308 0.985393
C  -0.245386 0.853553 -0.051648
C  -1.009559 0.855509 -1.400471
C  -2.823551 1.719304 1.174542
C  -2.880719 2.269897 -0.290298
C  1.268479 0.634332 -0.149096
C  -4.458245 -0.405047 -0.424144
C  -0.776796 -1.590893 0.816193
C  2.071946 0.845851 1.003252
C  1.915781 0.264287 -1.354188
C  3.473342 0.681399 0.971372
C  3.317511 0.097927 -1.415659
C  4.065337 0.307492 -0.246481
C  0.019601 -3.42989 -0.555766
H  -2.961345 -0.445944 1.75731
H  -3.052285 1.029962 -2.149679
H  -0.567259 0.14384 2.000476
H  -0.365053 1.871318 0.377989
H  -0.634124 1.677979 -2.040606
H  -0.850728 -0.100226 -1.929325
H  -2.071082 2.238961 1.794799
H  -3.797207 1.834499 1.682694
H  -3.890472 2.646746 -0.531388
H  -2.171896 3.099959 -0.460402
H  -4.700913 -1.276817 0.208555
H  -4.744575 -0.650076 -1.462414
H  -5.088467 0.452949 -0.087337
H  1.599952 1.149121 1.94613
H  1.325462 0.089469 -2.25759
H  4.093776 0.842051 1.85787
H  3.82193 -0.188067 -2.343443
H  0.573046 -3.526548 -1.500365
H  -0.972944 -3.906049 -0.622067
H  0.581147 -3.874531 0.282615
