program: Gaussian 09
title: 000105047
version: EM64L-G09RevD.01
frameworkgroup: C1[X(C12H14BrCl2O4P)]
method: RPBEPBE
basis: SDD
operation: Freq
keyword: #p
keyword: freq=noraman
keyword: PBEPBE/SDD
title: #p freq=noraman PBEPBE/SDD
converged: NO YES NO NO
title: Mulliken charges:
elementType: Br Cl Cl P O O O O C C C C C C C C C C C C H H H H H H H H H H H H H H
charge: 0.034583 -0.006383 -0.032771 1.402385 -0.531594 -0.522162 -0.499408 -0.575863 0.365018 0.498280 -0.223103 -0.214869 -0.259184 -0.336415 -0.652994 -0.659226 -0.192584 -0.223853 -0.096493 -0.666371 0.222855 0.245567 0.224044 0.255684 0.261533 0.215542 0.227604 0.235001 0.211426 0.239791 0.230704 0.285526 0.263180 0.274551
chargesum: 0.00000
title: Mulliken charges with hydrogens summed into heavy atoms:
elementType: Br Cl Cl P O O O O C C C C C C C C C C C C
charge: 0.034583 -0.006383 -0.032771 1.402385 -0.531594 -0.522162 -0.499408 -0.575863 0.365018 0.498280 0.245318 0.264859 -0.259184 -0.074882 0.025153 0.022695 0.092942 0.039327 -0.096493 -0.391820
polarizability: 2.84517345e+02 -3.09600957e+01 1.59436117e+02 -8.00745406e+00 -3.69865651e+00 1.84289183e+02
1716.lowfreq: -8.6930 -3.2630 -0.0008 -0.0008 0.0019 5.3461 8.6820 20.2008 26.3055
frequency: 7.6956 19.3979 26.2206 27.1037 34.2668 40.4842 50.3859 57.8030 73.4979 94.5862 107.4419 117.5184 152.7761 160.0975 165.2294 182.2447 204.2745 216.1708 231.1281 236.8931 258.5122 278.1747 287.4591 302.5853 356.1668 362.9329 381.0567 396.9739 416.1617 440.8718 447.6226 501.5435 548.4996 561.1580 629.8619 639.2756 651.9100 682.9606 704.7357 726.6795 756.9638 765.2940 806.5749 808.7091 830.8110 832.3038 865.1753 872.2518 879.2416 957.7219 993.2922 1009.4745 1018.4676 1056.0263 1066.2731 1083.0402 1103.0615 1107.5064 1130.4417 1135.2542 1138.4574 1206.7324 1243.2591 1250.9781 1256.8579 1276.8567 1348.5637 1355.5846 1357.3604 1378.1189 1394.0907 1395.8796 1452.0444 1456.3136 1457.3602 1477.0411 1478.3156 1487.8141 1490.7936 1557.3712 1586.1306 1630.3060 2994.1763 2995.5536 2998.7035 3006.7708 3062.9579 3079.0695 3091.4328 3092.6166 3109.2071 3114.8255 3152.6553 3181.1248 3185.4752 3209.0818
redmass: 5.3397 2.5285 4.6628 3.6299 5.3721 6.2091 4.5837 2.3917 6.6648 4.8161 5.4342 7.8110 18.1228 7.2145 6.3737 4.9031 6.3627 5.7489 1.7706 1.1930 3.1907 5.9778 4.8936 4.9761 7.7061 6.5605 9.7615 6.7067 6.8228 6.2537 4.1011 8.2150 10.0824 4.7781 6.0001 7.2979 5.9694 6.9131 5.8246 4.0009 1.4564 4.4065 1.0893 1.0950 1.8335 3.8250 4.0681 1.4122 4.9996 1.3517 5.1785 2.4373 2.6681 2.8939 11.1776 2.8197 2.2150 2.4035 1.4088 1.4448 1.4097 1.4561 1.4044 1.1489 1.1407 2.3136 4.6216 1.2548 1.2447 5.0622 1.2454 1.2436 2.7169 1.0396 1.0420 1.0521 1.0532 1.0815 1.0838 8.4562 7.2596 9.8417 1.0375 1.0363 1.0555 1.0592 1.1079 1.1056 1.0981 1.0976 1.1025 1.1031 1.0896 1.0959 1.0940 1.0947
irintensity: 0.8315 0.1356 0.4364 0.3458 1.3823 0.0959 1.3527 2.7807 0.8964 2.5286 1.0772 1.1385 0.6856 2.5455 0.0265 2.3726 1.8623 1.5901 2.8319 0.0979 4.6149 17.3799 4.1162 19.2909 7.0135 15.3247 0.8183 10.3666 11.8316 3.2263 33.4478 42.0930 75.4607 1.0556 47.0184 25.6314 54.2422 20.9975 103.1851 5.6902 45.6583 76.8672 2.1897 7.0871 13.7405 85.2735 148.1185 18.3922 245.9664 0.7807 178.6575 139.5152 41.2078 99.2938 103.8140 44.8881 5.8762 33.1826 4.7161 4.3380 6.2687 24.3788 13.6629 1.2696 0.9809 78.7283 12.1147 1.9582 4.7040 17.7777 27.2286 27.8372 59.3595 12.0646 12.7302 6.4703 4.8689 17.1467 3.8198 27.2879 102.7473 31.5876 16.9852 19.0608 33.1777 18.3447 6.8494 3.3235 27.8619 22.3992 36.1339 35.1673 2.8181 0.7382 1.5509 15.9803
temp: 298.150 k
press: 1.00000 atm
elementType: 35 17 17 15 8 8 8 8 6 6 6 6 6 6 6 6 6 6 6 6 1 1 1 1 1 1 1 1 1 1 1 1 1 1
symmnumber: 1
zpe: 626891.8 jmol-1
zpe.correction: 0.238770 hartree
zpe.thermalcorrener: 0.262577 hartree
zpe.thermalcorrenthalpy: 0.263521 hartree
zpe.thermalcorrgfe: 0.178683 hartree
zpe.sumelectzpe: -2039.821785 hartree
zpe.sumelectthermal: -2039.797979 hartree
zpe.sumelectthermalent: -2039.797034 hartree
zpe.sumelectthermalfe: -2039.881872 hartree
dipole: 1.5719 0.4221 4.2759
dipole: 4.5752
quadrupole: -139.7840 -148.0475 -144.2005
quadrupole: 8.1196 -4.0718 9.1512
quadrupole: 4.2267 -4.0368 -0.1899 8.1196 -4.0718 9.1512
hfenergy: -2040.0605551 hartree
pointgroup: C01 [X(C12H14Br1Cl2O4P1)]
dipole: 0.6917989 -0.7187967 -1.4982638 debye
polarizability: 255.9139574|59.1934836|187.4728654|-17.131923|-0.5938531|184.855822 unknown
InChI: InChI=1S/C12H14BrCl2O4P/c1-3-17-20(16,18-4-2)19-12(8-13)10-6-5-9(14)7-11(10)15/h5-8H,3-4H2,1-2H3
charge 0 multiplicity 1
34 atoms
Br 1.92208 2.743224 -2.332871
Cl -1.380361 1.902166 1.993032
Cl -5.260378 -1.680291 0.370218
P  1.560997 -0.531172 0.903658
O  1.129234 1.009833 0.177533
O  1.847611 -1.414958 -0.558825
O  3.061279 -0.07638 1.573825
O  0.592648 -1.221813 1.944091
C  -1.235591 0.493614 -0.437127
C  0.065222 1.15775 -0.73463
C  1.776842 -2.913218 -0.512479
C  4.075172 0.678779 0.757032
C  -1.968188 0.711849 0.759961
C  -1.787396 -0.405973 -1.38947
C  1.631916 -3.37638 -1.95816
C  5.282368 0.855633 1.670116
C  -3.186653 0.057608 1.020175
C  -3.011536 -1.068202 -1.164268
C  -3.688061 -0.827974 0.046951
C  0.235144 1.930479 -1.83808
H  2.709693 -3.289347 -0.052447
H  0.916578 -3.213901 0.113404
H  4.314695 0.085051 -0.145145
H  3.626928 1.640295 0.453896
H  -1.228128 -0.593441 -2.311804
H  1.613578 -4.481421 -1.995856
H  0.694614 -2.995871 -2.398526
H  2.477523 -3.020219 -2.570483
H  6.070557 1.417901 1.135526
H  5.004555 1.419136 2.576411
H  5.693408 -0.121045 1.97627
H  -3.72838 0.24004 1.951107
H  -3.421986 -1.759035 -1.905093
H  -0.585183 2.179484 -2.512742
