program: Gaussian 09
title: 000105035
version: EM64L-G09RevD.01
frameworkgroup: C1[X(CH3N3O2)]
method: RPBEPBE
basis: SDD
operation: Freq
keyword: #pfreq=noraman
keyword: PBEPBE/SDD
title: #p freq=noraman PBEPBE/SDD
converged: YES YES YES YES
title: Mulliken charges:
elementType: O O N N N C H H H
charge: -0.221416 -0.235188 -0.357379 -0.629525 0.143383 0.324598 0.304800 0.354956 0.315772
chargesum: 0.00000
title: Mulliken charges with hydrogens summed into heavy atoms:
elementType: O O N N N C
charge: -0.221416 -0.235188 -0.052580 0.041203 0.143383 0.324598
polarizability: 6.61082733e+01 -1.77850979e+00 4.34830292e+01 7.19505893e-03 4.56446110e-03 1.75047785e+01
1716.lowfreq: -5.1743 -4.1542 -0.0009 0.0008 0.0008 11.1789 67.5147 166.4253 199.9739
frequency: 67.5064 166.4238 199.9737 400.2597 401.8333 510.7227 547.5386 615.7007 703.5575 713.8353 925.9873 982.3363 1058.8145 1248.9639 1379.2762 1432.1882 1608.7910 1691.3799 3352.1806 3531.6400 3683.5948
redmass: 2.9652 8.6680 7.8762 1.2326 5.1745 5.8983 1.1733 4.2617 1.6309 3.6545 2.2878 6.7211 2.7998 2.5151 8.7029 1.9546 1.2169 6.0091 1.0764 1.0458 1.1046
irintensity: 0.1464 0.0507 2.6215 73.1595 4.9805 9.3618 232.6203 4.4284 193.0559 0.1137 72.0609 328.2278 53.7971 207.6211 7.7357 264.0393 66.7974 338.2215 1.8345 53.8564 41.0855
temp: 298.150 k
press: 1.00000 atm
elementType: 8 8 7 7 7 6 1 1 1
symmnumber: 1
zpe: 150864.1 jmol-1
zpe.correction: 0.057461 hartree
zpe.thermalcorrener: 0.063814 hartree
zpe.thermalcorrenthalpy: 0.064758 hartree
zpe.thermalcorrgfe: 0.027090 hartree
zpe.sumelectzpe: -354.081797 hartree
zpe.sumelectthermal: -354.075444 hartree
zpe.sumelectthermalent: -354.074500 hartree
zpe.sumelectthermalfe: -354.112169 hartree
dipole: 3.5652 -5.3717 0.0002
dipole: 6.4471
quadrupole: -35.5587 -33.7442 -34.5227
quadrupole: -5.3208 -0.0010 -0.0027
quadrupole: -0.9502 0.8643 0.0859 -5.3208 -0.0010 -0.0027
hfenergy: -354.1392582 hartree
pointgroup: C01 [X(C1H3N3O2)]
dipole: 1.3519327 2.1461725 -0.000089 debye
dipolederiv: -0.6450605 0.139548 0.0000129 0.1536034 -1.0016127 0.0000646 0.0000587 -0.000172 -0.3543189 -1.1381332 -0.2053065 0.0000595 0.5233158 -0.2110106 -0.000204 0.0005852 0.0001074 -0.1791207 -1.6261423 0.0653946 0.000273 -0.5109087 -0.2123682 0.0000207 -0.0005138 0.0000861 -0.2960347 -0.907043 -0.4729048 -0.0000664 -0.4419838 -0.6950677 -0.0000454 -0.0000982 0.0000041 -0.7665255 1.7910273 0.309754 -0.0002681 0.4154545 0.2007916 0.0002484 -0.0001968 0.0000015 0.0102541 2.074226 0.0924104 -0.0000477 -0.1591751 1.5911082 -0.0000261 -0.00006 0.0000257 0.3984305 0.0261291 0.0120407 -0.0000231 -0.0352659 0.0110534 -0.0000832 0.0000803 -0.0001288 0.3635601 0.2306985 0.0233506 0.0000229 -0.0004017 0.1764577 0.0000137 0.0000824 0.0000316 0.405819 0.1942981 0.0357131 0.0000369 0.0553615 0.1406483 0.0000113 0.0000621 0.0000445 0.4179362 unknown
polarizability: 66.0107991|2.3149456|43.5805034|-0.0073017|0.0043919|17.5047785 unknown
InChI: InChI=1S/CH3N3O2/c2-1(5)3-4-6/h3H,2H2
charge 0 multiplicity 1
9 atoms
O  1.279231 -1.268319 -0.000184
O  -2.526368 0.248184 0.000575
N  -0.320939 0.484598 -0.00001
N  1.977087 0.959825 -0.000005
N  -1.422062 -0.387874 -0.00036
C  1.018721 -0.044662 0.000125
H  -0.524294 1.499462 0.000098
H  2.951253 0.663508 -0.000169
H  1.766472 1.956178 -0.00007
