program: Gaussian 09
title: 000008458
version: EM64L-G09RevD.01
frameworkgroup: C1[X(C7H7NO5S)]
method: RPBEPBE
basis: SDD
operation: Freq
keyword: #p
keyword: freq=noraman
keyword: PBEPBE/SDD
title: #p freq=noraman PBEPBE/SDD
converged: YES YES NO NO
title: Mulliken charges:
elementType: S O O O O O N C C C C C C C H H H H H H H
charge: 0.983989 -0.567837 -0.487648 -0.491138 -0.195976 -0.186425 0.026174 -0.185309 0.519278 -0.399259 -0.351217 0.413371 -0.358732 -0.795020 0.347240 0.257767 0.295615 0.276334 0.281960 0.228639 0.388196
chargesum: 0.00000
title: Mulliken charges with hydrogens summed into heavy atoms:
elementType: S O O O O O N C C C C C C C
charge: 0.983989 -0.179642 -0.487648 -0.491138 -0.195976 -0.186425 0.026174 -0.185309 0.519278 -0.052018 -0.093450 0.413371 -0.063117 -0.008088
polarizability: 1.77551231e+02 4.61460152e+00 1.40778484e+02 -1.01474772e+00 3.03429142e-01 7.04627115e+01
1716.lowfreq: -6.8037 -6.0282 -0.0026 -0.0026 -0.0018 6.8540 48.0363 53.5590 102.4637
frequency: 48.0086 53.5523 102.3642 111.2127 119.2446 133.4137 171.5534 199.5924 223.6675 240.6133 254.8565 292.7253 313.0200 334.4406 348.9081 388.9242 442.4115 451.1320 514.0911 525.6574 553.3410 615.5669 666.3686 689.7474 713.2849 753.6933 826.2146 840.6696 852.4691 956.0835 961.2681 997.4257 1003.1619 1009.0680 1049.5344 1054.9830 1098.6652 1143.9385 1205.4194 1220.6898 1263.3454 1355.2640 1390.5661 1406.3201 1410.6248 1458.3430 1460.8039 1477.6938 1578.7181 1604.2581 2995.1213 3077.4751 3110.5221 3154.9756 3161.5798 3185.8216 3482.8508
redmass: 10.7415 12.3318 1.8057 4.5468 5.5103 2.0530 2.5295 2.8102 4.0096 8.7657 2.9720 4.9933 5.8866 7.0956 7.3883 6.5096 6.1932 3.4227 5.8485 5.6465 10.8213 7.3155 7.9863 6.1738 3.4715 7.2592 9.2610 9.1408 1.3247 1.4616 7.3944 1.3626 1.7714 2.3646 1.1914 1.5556 2.9811 1.2453 4.0054 5.5209 1.4162 4.1185 7.3041 4.8797 1.3025 1.0549 2.7029 1.1234 7.3218 7.4353 1.0372 1.0965 1.1006 1.0905 1.0925 1.0956 1.0662
irintensity: 0.5304 0.5239 0.7647 0.9544 2.3873 0.4647 29.1053 17.7577 15.0138 11.7190 28.6931 9.4447 32.8179 8.8448 2.5064 20.5439 48.5746 15.6326 54.5055 1.9008 107.1959 4.1898 6.0169 1.9288 15.6659 17.5320 30.4530 49.8122 20.2691 32.7407 75.3530 2.4956 7.3059 4.9631 74.1916 11.0613 26.2140 15.8414 206.2649 122.2485 1.1898 27.3686 68.9941 22.9944 31.5273 23.0317 12.7407 35.4967 0.1010 36.1752 4.9707 1.1773 15.8060 4.2190 24.5020 2.9457 53.2844
temp: 298.150 k
press: 1.00000 atm
elementType: 16 8 8 8 8 8 7 6 6 6 6 6 6 6 1 1 1 1 1 1 1
symmnumber: 1
zpe: 359210.3 jmol-1
zpe.correction: 0.136816 hartree
zpe.thermalcorrener: 0.151037 hartree
zpe.thermalcorrenthalpy: 0.151981 hartree
zpe.thermalcorrgfe: 0.095334 hartree
zpe.sumelectzpe: -1098.576739 hartree
zpe.sumelectthermal: -1098.562518 hartree
zpe.sumelectthermalent: -1098.561574 hartree
zpe.sumelectthermalfe: -1098.618221 hartree
dipole: 2.0991 5.2829 1.3584
dipole: 5.8447
quadrupole: -102.4872 -86.5910 -90.8078
quadrupole: -5.0077 8.3232 -2.4965
quadrupole: -9.1919 6.7044 2.4875 -5.0077 8.3232 -2.4965
hfenergy: -1098.7135551 hartree
pointgroup: C01 [X(C7H7N1O5S1)]
dipole: 0.9238451 2.0240201 0.5808787 debye
dipolederiv: 1.6619404 -0.2254426 0.101315 -0.311563 1.3920104 0.023541 0.1647526 -0.0392743 1.5485436 -0.5991477 -0.0804451 -0.2470945 -0.0406338 -0.4783014 0.0337314 -0.3157212 0.0547264 -0.9356186 -0.5809357 0.0425605 -0.0259504 0.0716975 -0.6581048 -0.0505258 0.0000947 0.0160718 -0.4475977 -0.6791666 0.0459927 0.1001359 0.071078 -0.5424762 0.0672322 0.0629585 0.0363659 -0.5451459 -0.9117369 0.1301394 -0.0064115 0.0667648 -0.494913 -0.0044072 -0.0045095 -0.0035997 -0.2197095 -0.5645389 -0.1160574 -0.0064368 -0.1476967 -0.7561583 -0.0127541 -0.0054657 -0.0100964 -0.2106346 1.7062583 0.215126 0.0204947 0.3773267 1.1365662 0.0242255 0.0206043 0.0160742 0.19179 -0.0535389 -0.2101807 0.0130846 -0.3017976 -0.1875165 0.006842 0.0955884 -0.0401225 -0.1658929 0.3277573 0.4363976 0.0062588 0.073877 0.141604 0.0037617 0.0139068 0.0069898 0.0488681 0.1046228 0.0544301 0.0075263 0.1441856 -0.2210039 -0.0009947 -0.0065541 -0.0011874 -0.0461263 -0.4477994 -0.1843448 -0.0057057 0.1023766 0.1226067 0.0088027 -0.0108243 0.0094762 -0.1304741 -0.5152793 -0.1526214 -0.0111757 -0.3563361 -0.1499608 -0.0080232 -0.0261226 0.0015833 0.0553122 0.1287709 -0.0176691 -0.0008775 0.2710401 0.1117384 0.0054011 0.0121615 0.0017978 -0.0685219 -0.3509422 -0.1756429 -0.0104821 -0.0317596 0.0605031 0.0112707 0.0128595 0.0046166 -0.0351466 0.2108922 -0.0056908 0.0066392 -0.0059161 0.1431014 -0.0050626 0.0070147 -0.0045531 0.1723927 0.0505159 -0.0151236 -0.0022915 -0.0026837 -0.0652114 -0.0038587 -0.0016133 -0.0066916 0.1517063 0.0728617 0.0555061 -0.0001932 0.0210783 0.1216679 -0.0010195 0.0011377 -0.0006896 0.1674989 0.0736577 -0.0075155 -0.0444283 -0.0365281 0.092086 0.0682024 -0.0628587 0.0309221 0.0183083 0.0881533 -0.0187417 0.0487282 -0.0315765 0.1106034 -0.0728153 0.0533692 -0.029881 0.0340151 0.079514 0.1033152 -0.0002232 -0.0104717 -0.127068 -0.0070413 -0.0071987 -0.0139973 0.1278182 0.1981414 0.126008 0.0570877 0.0775384 0.2482269 -0.0865081 -0.00358 -0.0285311 0.2886148 unknown
polarizability: 177.9240244|2.5543403|140.3673866|1.8150393|1.1947242|70.5010158 unknown
InChI: InChI=1S/C7H7NO5S/c1-5-2-3-6(8(9)10)4-7(5)14(11,12)13/h2-4,11H,1H3
charge 0 multiplicity 1
21 atoms
S  2.207917 -1.024714 -0.072771
O  2.742299 -0.626234 1.663652
O  1.756527 -2.573769 -0.159048
O  3.327511 -0.461643 -1.095304
O  -4.100797 0.147336 -0.049304
O  -3.0261 -1.866968 -0.079612
N  -3.034437 -0.578743 -0.055933
C  0.663463 0.06709 -0.019637
C  0.781551 1.478905 0.013199
C  -0.542396 -0.641874 -0.040401
C  -0.450453 2.190443 0.016775
C  -1.724862 0.123646 -0.035619
C  -1.695249 1.533276 -0.007353
C  2.10231 2.212609 0.055963
H  -0.57582 -1.736152 -0.061379
H  -0.418239 3.284288 0.042723
H  -2.637399 2.087615 -0.003763
H  2.688295 1.903622 0.940525
H  2.719952 1.974676 -0.828087
H  1.942135 3.301264 0.098479
H  3.578493 -1.143873 1.852297
