program: Gaussian 09
title: 000105022
version: EM64L-G09RevD.01
frameworkgroup: C1[X(C16H9NO3)]
method: RPBEPBE
basis: SDD
operation: Freq
keyword: #p
keyword: freq=noraman
keyword: PBEPBE/SDD
title: #p freq=noraman PBEPBE/SDD
converged: YES YES NO NO
title: Mulliken charges:
elementType: O O O N C C C C C C C C C C C C C C C C H H H H H H H H H
charge: -0.398743 -0.218213 -0.230364 0.016888 0.047599 0.013227 0.299801 0.441133 0.495849 0.487637 -0.481274 0.208921 -0.416898 -0.494594 -0.480035 0.035992 -0.471312 -0.447299 -0.444980 -0.380509 0.311813 0.188134 0.249326 0.247370 0.251260 0.249870 0.289661 0.259256 0.370484
chargesum: 0.00000
title: Mulliken charges with hydrogens summed into heavy atoms:
elementType: O O O N C C C C C C C C C C C C C C C C
charge: -0.028259 -0.218213 -0.230364 0.016888 0.047599 0.013227 0.299801 0.441133 0.495849 0.487637 -0.169462 0.208921 -0.228764 -0.245269 -0.232665 0.035992 -0.220052 -0.197429 -0.155319 -0.121253
polarizability: 3.74583502e+02 6.11203170e+00 2.39875311e+02 -8.49104459e-02 -6.39580708e-02 7.01247817e+01
1716.lowfreq: -0.0008 -0.0006 -0.0002 7.4996 12.0458 14.5472 17.9755 60.0519 81.8451
frequency: 17.5814 60.0434 81.8411 130.3224 188.0293 203.6851 238.6130 268.4556 287.8284 315.6595 332.0390 353.0131 375.9404 395.8704 434.1998 454.1943 480.6915 500.0522 514.0264 515.4687 546.0638 562.7945 576.7523 614.9201 616.2932 680.8397 687.9412 695.1635 702.5757 727.7966 741.8366 803.0308 808.6782 821.8880 832.9855 833.1495 850.3452 883.8345 893.8614 963.1236 986.5517 995.0693 998.0934 999.0465 1082.7660 1111.7377 1137.3282 1156.2799 1162.7415 1174.2198 1186.8478 1192.2582 1205.3565 1245.7259 1255.7102 1305.4709 1321.0486 1344.6282 1385.2705 1393.0359 1400.7719 1420.0760 1432.5866 1439.4363 1470.2913 1497.3108 1509.2289 1550.2466 1592.3873 1606.1789 1613.7040 1627.6352 3095.5014 3127.9681 3139.8850 3144.5335 3152.0716 3178.2675 3188.2887 3213.7807 3581.3892
redmass: 15.0078 6.5538 4.9373 4.3389 9.6581 3.7014 5.5167 4.4593 7.8845 9.9557 4.8531 1.2466 7.2627 7.5766 3.5139 8.1574 5.2833 3.8523 4.9883 3.6676 3.6166 6.3090 6.7547 4.4130 6.7672 5.4315 7.0989 4.9839 6.1575 2.7680 9.1809 4.6743 1.3120 3.6603 1.8916 6.0029 1.7643 1.6024 6.1104 1.3634 1.3879 1.3279 3.6081 1.4243 2.9332 2.4688 1.6792 1.4313 1.9294 2.0482 2.3995 2.0539 1.5387 1.9931 1.6708 2.2937 4.2094 3.6102 3.0440 3.1431 6.3813 2.8126 3.3008 5.2224 4.2951 5.9441 4.2442 5.4345 6.5010 6.7297 7.5582 7.1606 1.0898 1.0869 1.0900 1.0910 1.0979 1.0955 1.0939 1.0929 1.0656
irintensity: 0.0036 1.6999 1.7872 0.0082 4.5411 0.9252 3.2786 2.0019 1.4589 0.5759 0.5503 135.3821 2.9005 0.2532 2.6047 6.5647 2.1162 6.1824 20.6280 0.1854 0.0273 4.3862 2.8314 6.6253 8.2888 3.4561 0.8595 6.3716 5.2676 14.7071 16.2593 3.6474 13.5146 0.0282 33.1275 11.2255 5.0835 119.6631 14.9171 1.3416 0.0031 3.2184 7.8372 0.9930 18.1297 13.4367 348.9302 94.4960 68.9489 242.5613 275.5177 131.7492 129.2991 25.5060 9.2599 9.1188 58.2894 15.3592 11.9732 6.5825 119.0898 0.5022 24.4778 6.1390 2.5494 58.8411 43.9379 24.8986 0.5999 90.6460 73.2368 97.9576 22.6056 1.3185 6.2013 5.5975 27.2180 9.4504 3.9096 10.4444 51.6271
temp: 298.150 k
press: 1.00000 atm
elementType: 8 8 8 7 6 6 6 6 6 6 6 6 6 6 6 6 6 6 6 6 1 1 1 1 1 1 1 1 1
symmnumber: 1
zpe: 547962.4 jmol-1
zpe.correction: 0.208708 hartree
zpe.thermalcorrener: 0.223019 hartree
zpe.thermalcorrenthalpy: 0.223963 hartree
zpe.thermalcorrgfe: 0.166713 hartree
zpe.sumelectzpe: -894.146795 hartree
zpe.sumelectthermal: -894.132484 hartree
zpe.sumelectthermalent: -894.131540 hartree
zpe.sumelectthermalfe: -894.188789 hartree
dipole: -5.4217 2.7261 -0.0018
dipole: 6.0685
quadrupole: -132.3753 -96.8173 -118.2477
quadrupole: 8.4154 0.0342 0.0719
quadrupole: -16.5618 18.9961 -2.4343 8.4154 0.0342 0.0719
hfenergy: -894.3555024 hartree
pointgroup: C01 [X(C16H9N1O3)]
dipole: -2.1463021 1.0457542 -0.0026454 debye
polarizability: 374.4012462|7.7797678|240.0240047|-1.6380481|-2.0929428|70.1583434 unknown
InChI: InChI=1S/C16H9NO3/c18-14-8-4-10-2-1-9-3-7-13(17(19)20)11-5-6-12(14)16(10)15(9)11/h1-8,18H
charge 0 multiplicity 1
29 atoms
O  -3.520857 -2.779726 0.062393
O  4.909883 -0.46958 -0.019022
O  3.515777 -2.25942 0.040998
N  3.716171 -0.977267 0.008646
C  0.176832 0.565367 0.007748
C  -1.222969 0.219027 0.017873
C  1.19471 -0.472303 0.015012
C  -1.625521 -1.164029 0.034761
C  0.548792 1.963104 -0.009784
C  -2.225484 1.256621 0.011093
C  0.749536 -1.849603 0.031227
C  2.568174 -0.04541 0.003123
C  -0.598306 -2.169407 0.040123
C  -0.47364 2.978434 -0.01605
C  -1.81546 2.636489 -0.005941
C  -3.023698 -1.475085 0.044954
C  1.928289 2.314703 -0.020954
C  -3.602014 0.891542 0.021259
C  2.917329 1.329769 -0.014993
C  -3.999317 -0.452814 0.037945
H  1.500882 -2.637184 0.036992
H  -0.859398 -3.236553 0.051755
H  -0.164648 4.029208 -0.029327
H  -2.588269 3.413694 -0.010913
H  2.211288 3.372541 -0.034508
H  -4.362246 1.680477 0.016043
H  3.978304 1.58878 -0.024054
H  -5.053977 -0.740697 0.046072
H  -2.800263 -3.457278 0.06723
