program: Gaussian 09
title: 000104994
version: EM64L-G09RevD.01
frameworkgroup: C1[X(C7H5N5)]
method: RPBEPBE
basis: SDD
operation: Freq
keyword: #p
keyword: freq=noraman
keyword: PBEPBE/SDD
title: #p freq=noraman PBEPBE/SDD
converged: NO NO NO NO
title: Mulliken charges:
elementType: N N N N N C C C C C C C H H H H H
charge: -0.206049 -0.388465 -0.092544 0.053161 -0.026808 0.181305 0.175201 -0.137884 -0.229295 -0.166287 -0.320303 -0.223593 0.334352 0.253708 0.264893 0.260935 0.267675
chargesum: 0.00000
title: Mulliken charges with hydrogens summed into heavy atoms:
elementType: N N N N N C C C C C C C
charge: -0.206049 -0.054113 -0.092544 0.053161 -0.026808 0.181305 0.175201 -0.137884 0.024413 0.098606 -0.059368 0.044081
polarizability: 1.66364401e+02 1.93370218e+00 1.09774426e+02 6.26100917e-03 -3.13912078e-04 4.26129094e+01
1716.lowfreq: -0.0006 -0.0004 0.0001 8.6168 11.6277 18.3533 132.0046 179.0300 267.1882
frequency: 132.0032 179.0281 267.1872 281.9393 331.7139 462.1329 499.2398 554.6537 597.6728 617.8361 623.5425 661.1441 671.9499 693.1605 724.0752 768.6187 801.6321 808.3047 856.0541 871.5866 884.4743 909.5877 1017.8523 1049.3905 1058.7863 1092.7024 1143.9350 1209.2797 1247.6103 1253.9377 1304.1331 1317.8528 1330.9309 1367.6362 1376.0205 1434.1931 1447.5764 1471.8783 1507.0455 1670.3773 3173.1967 3226.8780 3244.9727 3257.0759 3584.7479
redmass: 5.6085 6.1466 4.5958 5.3844 6.2546 6.8586 8.9739 4.1125 6.3929 3.3285 3.9139 1.1567 9.0779 6.8719 1.3379 6.2172 7.1319 1.5838 1.4411 1.3752 7.0285 7.9952 4.2232 2.6012 1.6353 2.6924 2.5079 2.9991 2.3466 3.2499 3.8957 2.4957 3.4872 2.8746 2.3279 3.7794 4.0144 4.7799 6.9835 10.4423 1.0931 1.0924 1.0991 1.1067 1.0826
irintensity: 0.7887 21.1877 4.9015 8.1353 0.7620 0.3173 0.3911 0.0117 2.5678 0.2692 43.8043 92.0619 1.9555 12.5901 59.7852 2.3370 3.9005 13.3910 32.2192 6.0948 0.9600 2.2917 5.9052 40.6678 8.1790 4.3398 27.6461 52.0243 6.5759 40.2874 42.8459 8.3284 30.1979 11.6618 27.4527 13.4698 4.7443 14.9811 10.5370 38.4657 2.7066 5.3599 0.9578 0.7147 69.3598
temp: 298.150 k
press: 1.00000 atm
elementType: 7 7 7 7 7 6 6 6 6 6 6 6 1 1 1 1 1
symmnumber: 1
zpe: 316923.9 jmol-1
zpe.correction: 0.120710 hartree
zpe.thermalcorrener: 0.128429 hartree
zpe.thermalcorrenthalpy: 0.129373 hartree
zpe.thermalcorrgfe: 0.087959 hartree
zpe.sumelectzpe: -542.670632 hartree
zpe.sumelectthermal: -542.662912 hartree
zpe.sumelectthermalent: -542.661968 hartree
zpe.sumelectthermalfe: -542.703383 hartree
dipole: 2.1738 -2.2130 -0.0001
dipole: 3.1021
quadrupole: -61.7054 -68.0666 -71.1035
quadrupole: 19.8797 0.0003 0.0009
quadrupole: 5.2531 -1.1081 -4.1450 19.8797 0.0003 0.0009
hfenergy: -542.7913416 hartree
pointgroup: C01 [X(C7H5N5)]
dipole: 0.89521 0.8295185 0.0000525 debye
dipolederiv: 0.0023728 -0.0984788 -0.0000158 -0.4098821 -0.7158219 0.0000408 -0.0000013 0.0000427 0.0735568 -0.3090388 -0.0395073 -0.0000159 0.1466309 -0.5798828 -0.0000118 0.0000084 -0.0000032 -0.2300965 -0.6503771 -0.0256616 0.0000214 -0.3156142 -0.4356831 0.0000165 0.0000388 0.0000166 -0.2600736 -0.3535512 -0.1476902 -0.000008 -0.1378625 -0.2260618 0.0000199 0.0000091 -0.0000033 -0.2068873 -0.3598458 0.0905492 0.0000128 0.0385236 -0.4142955 0.0000071 -0.0000042 -0.0000118 -0.2507685 -0.1196436 -0.2223492 0.0000167 -0.4152351 0.2812831 0.0000158 -0.0000173 0.0000225 0.0834523 0.3583972 0.176316 -0.0000289 0.5403246 0.4763201 -0.0000619 -0.0000404 -0.0000356 0.0654858 0.4932545 -0.2370847 -0.000006 0.076774 0.0750676 -0.0000212 -0.0000031 0.000016 0.0388503 0.4215939 0.2943313 0.0000018 0.1742296 0.479129 0.0000038 -0.0000245 -0.0000065 -0.0426462 -0.1883088 0.0103322 0.0000036 0.0017059 -0.0349284 -0.0000196 0.0000461 -0.0000454 -0.1957339 0.2672727 -0.0662466 -0.0000141 0.04036 0.2212625 -0.000003 -0.0000297 -0.0000126 -0.1345682 0.1311009 0.1944833 -0.0000023 0.2269674 0.4377128 0.0000058 0.0000361 -0.000018 -0.0624054 0.1731106 -0.0291634 0.0000107 -0.056451 0.238721 0.000002 0.0000097 0.0000017 0.3605452 0.0124373 0.0724688 0.0000046 0.0376534 0.017101 0.0000002 0.0000007 -0.0000082 0.1570646 0.0883207 0.0140036 0.0000046 0.0718475 0.0274851 0.0000074 -0.0000169 0.0000223 0.2367073 -0.0227954 -0.0391446 0.0000088 -0.07498 0.0937405 0.0000056 0.0000168 0.0000131 0.1775633 0.0557001 0.052842 0.000006 0.0550079 0.0588508 -0.0000074 -0.0000282 0.0000098 0.1899539 unknown
polarizability: 166.0578279|-4.5819436|110.0809998|-0.0062688|-0.0000193|42.6129094 unknown
InChI: InChI=1S/C7H5N5/c1-2-12-4-11-6-5(7(12)8-1)9-3-10-6/h1-4,9H
charge 0 multiplicity 1
17 atoms
N  1.351377 -0.712733 -0.00005
N  -1.629403 1.573407 0.000053
N  1.698955 1.570691 -0.000193
N  -0.746018 -1.893284 0.000004
N  -2.753798 -0.420312 0.000027
C  -0.658528 0.582616 0.000003
C  0.758104 0.597429 -0.000063
C  -1.369123 -0.65497 0.000042
C  0.577985 -1.891375 -0.000023
C  2.74251 -0.506246 -0.000181
C  2.921164 0.881077 -0.000182
C  -2.872844 0.918768 0.000126
H  -1.457594 2.578684 0.000025
H  1.127738 -2.835821 -0.000046
H  3.451218 -1.329225 -0.000172
H  3.863795 1.424509 -0.000232
H  -3.815538 1.460584 0.00016
