program: Gaussian 09
title: 000104988
version: EM64L-G09RevD.01
frameworkgroup: C1[X(C16H9NO3)]
method: RPBEPBE
basis: SDD
operation: Freq
keyword: #p
keyword: freq=noraman
keyword: PBEPBE/SDD
title: #p freq=noraman PBEPBE/SDD
converged: YES YES NO YES
title: Mulliken charges:
elementType: O O O N C C C C C C C C C C C C C C C C H H H H H H H H H
charge: -0.399646 -0.219923 -0.227330 0.018471 0.049219 0.018215 0.297598 0.508175 0.397569 0.517217 -0.433781 0.204921 -0.490398 -0.534018 -0.414143 -0.476054 0.039470 -0.451053 -0.443225 -0.378478 0.310388 0.246598 0.249931 0.189841 0.251946 0.253505 0.290173 0.259475 0.365336
chargesum: 0.00000
title: Mulliken charges with hydrogens summed into heavy atoms:
elementType: O O O N C C C C C C C C C C C C C C C C
charge: -0.034310 -0.219923 -0.227330 0.018471 0.049219 0.018215 0.297598 0.508175 0.397569 0.517217 -0.123394 0.204921 -0.243800 -0.284087 -0.224302 -0.224108 0.039470 -0.197548 -0.153052 -0.119003
polarizability: 3.82569031e+02 1.64125092e+01 2.33039995e+02 -3.00642610e-03 -8.51636272e-04 7.00893286e+01
1716.lowfreq: -9.4696 0.0003 0.0004 0.0009 4.4576 7.7075 13.2306 50.9233 101.2522
frequency: 12.9426 50.9134 101.2510 113.9619 198.4162 201.2192 240.7351 265.7044 267.8319 322.1313 330.2938 337.0265 358.5355 425.1937 437.1309 437.1625 488.3629 501.8274 508.3864 510.7069 545.1070 549.2269 585.7967 610.1269 623.4996 683.9692 687.0599 694.4803 703.0085 727.5073 758.8824 776.5399 805.3907 811.2913 818.7885 827.2969 867.0072 878.0207 944.7955 963.9307 969.0872 970.1652 995.4719 1010.6771 1079.3426 1112.0675 1135.4256 1156.7376 1159.2004 1176.8389 1182.7580 1187.7910 1205.4738 1249.1150 1257.7456 1301.7816 1320.3762 1345.1417 1383.5970 1386.9320 1395.9836 1413.4355 1435.6957 1442.3434 1473.8104 1499.6962 1505.4775 1548.2496 1595.0830 1606.4986 1612.6610 1627.4694 3097.5627 3134.1536 3141.8549 3144.3514 3147.4937 3178.1042 3188.0002 3220.5702 3585.6944
redmass: 14.2100 7.9912 4.7571 4.0887 9.5576 4.1901 3.9079 4.4990 8.0583 4.1487 9.3466 1.3820 7.6340 7.1071 6.0111 4.1752 5.0847 4.6561 3.5690 5.8004 6.1864 3.1196 5.7207 5.2722 7.6653 4.6889 7.1955 5.0580 6.6308 2.7143 5.8897 8.1314 1.4824 5.6806 3.6408 1.7093 1.6397 1.5486 6.1117 1.3693 1.3936 4.4898 1.3537 1.3455 2.5229 2.7406 1.6507 1.7496 1.7922 1.7076 2.6837 1.9373 1.5272 1.6409 2.0536 2.1568 4.0128 4.4860 3.9580 2.8480 3.5441 6.7575 2.4839 3.9881 4.7991 6.3101 3.8840 5.6629 6.3280 7.1891 7.0883 7.1950 1.0876 1.0914 1.0899 1.0925 1.0937 1.0956 1.0939 1.0928 1.0655
irintensity: 0.0044 0.9104 3.2116 1.2537 1.7610 1.3199 0.9682 0.6167 3.5048 18.5903 0.2006 119.7501 5.9672 0.8686 4.1562 1.9030 6.8888 4.9072 0.7423 0.2592 25.4106 0.2523 6.2105 5.5668 0.5703 0.1441 0.0729 13.4799 21.6385 16.8428 2.9839 6.5273 4.4024 1.5207 0.0567 2.7978 75.6989 84.0740 37.4632 5.4235 1.4193 1.3056 0.1563 0.3361 48.9685 22.0069 417.9040 34.8103 188.8054 7.4046 346.0112 244.4521 51.2861 16.3221 7.6017 35.0131 25.7880 32.3397 1.1839 77.1069 50.4143 26.5335 13.5849 0.1762 4.8966 2.2602 131.6568 21.8472 8.8675 47.4366 81.9775 111.8920 16.8893 9.5718 9.6720 2.6773 22.5481 9.1258 3.6270 9.0282 57.4915
temp: 298.150 k
press: 1.00000 atm
elementType: 8 8 8 7 6 6 6 6 6 6 6 6 6 6 6 6 6 6 6 6 1 1 1 1 1 1 1 1 1
symmnumber: 1
zpe: 547598.8 jmol-1
zpe.correction: 0.208569 hartree
zpe.thermalcorrener: 0.222938 hartree
zpe.thermalcorrenthalpy: 0.223883 hartree
zpe.thermalcorrgfe: 0.166232 hartree
zpe.sumelectzpe: -894.145873 hartree
zpe.sumelectthermal: -894.131504 hartree
zpe.sumelectthermalent: -894.130560 hartree
zpe.sumelectthermalfe: -894.188210 hartree
dipole: -6.4495 2.9225 0.0053
dipole: 7.0808
quadrupole: -137.2307 -93.3528 -118.2447
quadrupole: 3.1384 -0.0128 0.0018
quadrupole: -20.9546 22.9233 -1.9686 3.1384 -0.0128 0.0018
hfenergy: -894.3544427 hartree
pointgroup: C01 [X(C16H9N1O3)]
dipole: -2.5254174 1.1756628 -0.0263438 debye
polarizability: 382.867984|14.8873883|232.7142669|2.5689288|-0.8363693|70.1161036 unknown
InChI: InChI=1S/C16H9NO3/c18-14-8-4-10-1-5-11-13(17(19)20)7-3-9-2-6-12(14)16(10)15(9)11/h1-8,18H
charge 0 multiplicity 1
29 atoms
O  -4.815962 0.680568 -0.058388
O  5.012143 0.225871 0.029344
O  3.973755 -1.791735 0.032461
N  3.933217 -0.495475 0.024603
C  0.169049 0.371808 -0.011612
C  -1.144149 -0.224624 -0.019258
C  1.35917 -0.4679 0.003382
C  0.283646 1.810797 -0.019119
C  -2.324677 0.609328 -0.034562
C  -1.281673 -1.656324 -0.011795
C  1.176054 -1.903328 0.010843
C  2.63034 0.208199 0.009662
C  -0.092639 -2.461501 0.003495
C  -0.909255 2.619625 -0.033207
C  -2.166552 2.041894 -0.040636
C  1.572523 2.413004 -0.012319
C  -3.609141 -0.024549 -0.042622
C  -2.583222 -2.234389 -0.019656
C  2.723839 1.623426 0.001743
C  -3.732477 -1.432721 -0.034933
H  2.058631 -2.539579 0.02235
H  -0.200722 -3.552459 0.009523
H  -0.799969 3.709483 -0.037654
H  -3.04196 2.705359 -0.050817
H  1.656989 3.504715 -0.018183
H  -2.682379 -3.325396 -0.013667
H  3.720365 2.070233 0.007081
H  -4.736344 -1.865615 -0.041287
H  -4.679699 1.659985 -0.061675
