program: Gaussian 09
title: 000104987
version: EM64L-G09RevD.01
frameworkgroup: C1[X(C20H12)]
method: RPBEPBE
basis: SDD
operation: Freq
keyword: #p
keyword: freq=noraman
keyword: PBEPBE/SDD
title: #p freq=noraman PBEPBE/SDD
converged: NO YES NO NO
title: Mulliken charges:
elementType: C C C C C C C C C C C C C C C C C C C C H H H H H H H H H H H H
charge: -0.388567 0.080595 0.427186 0.309445 0.652657 0.422427 -0.724243 0.123693 -0.374631 0.425524 -0.483669 -0.425495 -0.473026 -0.479657 -0.424875 -0.219906 -0.334434 -0.438528 -0.261385 -0.252046 0.232979 0.241176 0.242874 0.250833 0.244212 0.235233 0.248002 0.221603 0.220314 0.242490 0.228412 0.230808
chargesum: 0.00000
title: Mulliken charges with hydrogens summed into heavy atoms:
elementType: C C C C C C C C C C C C C C C C C C C C
charge: -0.388567 0.080595 0.427186 0.309445 0.652657 0.422427 -0.491264 0.123693 -0.133454 0.425524 -0.240795 -0.174663 -0.228814 -0.244423 -0.176874 0.001697 -0.114120 -0.196038 -0.032973 -0.021238
polarizability: 4.17688413e+02 3.50979456e+00 2.41580899e+02 -7.47753375e-03 -8.32155959e-04 7.90612507e+01
1716.lowfreq: -5.4860 -0.0007 -0.0003 0.0004 5.8512 7.2671 58.4013 65.7512 140.3653
frequency: 58.3802 65.7477 140.3643 161.9620 195.4644 215.8537 270.3353 282.9823 287.7415 345.5110 379.1646 421.2381 436.5144 475.3096 502.8155 512.2429 532.1272 556.9226 565.7164 572.2668 611.2065 625.3170 643.4508 649.2142 688.5741 713.2084 744.7031 747.9655 759.2254 771.0903 810.4845 813.6978 828.1945 855.3283 863.5174 868.6512 886.7608 913.1901 917.7474 938.6350 956.1642 961.8527 982.1939 984.8643 993.9816 1027.4238 1031.5824 1042.4115 1070.7459 1094.4823 1127.7347 1160.2270 1179.6424 1184.4367 1207.9916 1233.2133 1233.8997 1252.7426 1271.7468 1304.2004 1322.8443 1341.6785 1377.7642 1394.1738 1403.7320 1420.2048 1436.8157 1452.0147 1463.0204 1475.2710 1479.1642 1503.4391 1551.8534 1580.9217 1614.9635 1621.1601 1623.7882 1632.0547 3121.1724 3122.1048 3123.0011 3131.1451 3134.3906 3141.4095 3150.1468 3152.1672 3154.7544 3165.0278 3173.5987 3200.5444
redmass: 4.5988 4.6801 4.2547 5.0736 4.3777 3.8504 4.0195 3.9738 6.5046 5.5557 3.6504 3.0852 4.6983 4.7589 6.7768 3.2208 3.5907 6.7912 2.6974 6.3550 3.0943 6.8046 6.4294 4.1183 6.0858 2.6493 5.8018 1.5089 1.3170 1.4403 1.7486 6.6458 2.2625 4.3291 1.9065 4.5714 1.6907 1.7007 1.5042 1.8629 1.3871 4.9743 1.3800 1.3707 1.3984 2.2529 3.1626 2.3323 2.4763 1.3139 2.0457 1.4115 1.0868 1.2430 1.7499 1.6875 1.7071 1.9292 1.9052 1.9857 3.1734 4.2820 2.6639 3.8156 2.5741 3.0581 4.4849 3.2654 2.7416 6.7059 4.3692 3.5984 5.8246 7.7080 6.2568 7.0987 6.8859 7.9732 1.0868 1.0860 1.0861 1.0888 1.0923 1.0921 1.0974 1.0920 1.0980 1.0996 1.0884 1.1044
irintensity: 0.0549 1.2061 1.5620 0.4352 0.3108 7.2532 1.1257 1.0367 1.0459 0.5553 0.0004 6.1870 0.2790 2.3586 2.0592 3.0931 2.6193 13.0667 4.7347 0.2742 0.2571 1.9577 1.7492 0.0637 0.3039 17.2439 0.6146 51.1924 52.6680 0.0317 0.0015 7.3951 90.9180 7.5502 33.5524 0.1894 2.0824 19.3528 8.2065 3.2218 4.2676 0.2388 2.4897 1.2074 0.7941 1.8330 1.9517 8.9424 0.9560 25.1321 2.7986 2.0277 1.5052 11.4489 7.4176 12.5293 10.7739 7.4259 11.9895 2.3022 1.8815 4.5637 0.1933 3.6820 10.6053 3.9166 11.8636 9.7674 19.7473 42.7486 31.0025 7.9167 2.8164 9.8474 2.8017 15.5933 9.4215 17.6967 0.0899 0.1922 6.4681 6.8473 14.8819 7.0203 21.1939 23.6681 54.7855 40.1487 1.0692 21.3710
temp: 298.150 k
press: 1.00000 atm
elementType: 6 6 6 6 6 6 6 6 6 6 6 6 6 6 6 6 6 6 6 6 1 1 1 1 1 1 1 1 1 1 1 1
symmnumber: 1
zpe: 654325.5 jmol-1
zpe.correction: 0.249219 hartree
zpe.thermalcorrener: 0.262474 hartree
zpe.thermalcorrenthalpy: 0.263418 hartree
zpe.thermalcorrgfe: 0.209611 hartree
zpe.sumelectzpe: -768.052574 hartree
zpe.sumelectthermal: -768.039319 hartree
zpe.sumelectthermalent: -768.038375 hartree
zpe.sumelectthermalfe: -768.092183 hartree
dipole: 0.5944 -0.5661 0.0001
dipole: 0.8208
quadrupole: -95.3833 -97.2919 -124.2160
quadrupole: 2.0718 -0.0009 0.0001
quadrupole: 10.2471 8.3385 -18.5856 2.0718 -0.0009 0.0001
hfenergy: -768.3017933 hartree
pointgroup: C01 [X(C20H12)]
dipole: 0.2333346 -0.2232392 0.0000509 debye
polarizability: 417.7033565|3.1123509|241.5659548|-0.0074794|-0.0008153|79.0612507 unknown
InChI: InChI=1S/C20H12/c1-2-7-16-13(4-1)8-10-17-18-11-9-14-5-3-6-15(20(14)18)12-19(16)17/h1-12H
charge 0 multiplicity 1
32 atoms
C  -2.117569 0.049051 0.000012
C  -1.314219 1.217343 0.000003
C  0.096784 1.078076 0.000008
C  0.662985 -0.280691 0.000014
C  -1.61364 -1.272213 0.000087
C  -3.509235 0.398334 0.000081
C  -0.192529 -1.412476 0.000085
C  2.132166 -0.42674 -0.000024
C  -2.25227 2.363312 0.000043
C  2.963202 0.752364 0.000012
C  0.981983 2.221006 0.000021
C  -3.557256 1.877722 0.000109
C  -2.598952 -2.326306 0.000171
C  2.351992 2.066165 0.000039
C  -4.443915 -0.642728 0.000173
C  -3.96482 -2.004742 0.000203
C  2.785248 -1.695596 -0.000087
C  4.384733 0.624168 0.000006
C  4.18484 -1.803746 -0.000097
C  4.996804 -0.636172 -0.000048
H  0.23264 -2.421342 0.000138
H  -1.96678 3.417447 0.000025
H  0.537919 3.222049 0.000035
H  -4.468184 2.47993 0.000129
H  -2.283388 -3.376456 0.000204
H  3.010661 2.943154 0.00008
H  -5.523546 -0.452624 0.000236
H  -4.701534 -2.816419 0.000266
H  2.194247 -2.616484 -0.000151
H  4.994358 1.535764 0.000036
H  4.652629 -2.794495 -0.000155
H  6.088547 -0.723954 -0.000053
