program: Gaussian 09
title: 000104953
version: EM64L-G09RevD.01
frameworkgroup: C1[X(C15H14O4)]
method: RPBEPBE
basis: SDD
operation: Freq
keyword: #pfreq=noraman
keyword: PBEPBE/SDD
title: #p freq=noraman PBEPBE/SDD
converged: YES YES NO NO
title: Mulliken charges:
elementType: O O O O C C C C C C C C C C C C C C C H H H H H H H H H H H H H H
charge: -0.258884 -0.241289 -0.451720 -0.207592 0.219417 -0.016555 0.239057 0.196390 0.306501 0.039207 -0.619074 0.178907 0.359618 -0.488065 -0.782007 -0.777211 -0.484153 -0.810651 0.118397 0.274581 0.199506 0.209351 0.249445 0.249002 0.240748 0.250027 0.228614 0.254239 0.252419 0.239687 0.246430 0.239150 0.346508
chargesum: 0.00000
title: Mulliken charges with hydrogens summed into heavy atoms:
elementType: O O O O C C C C C C C C C C C C C C C
charge: -0.258884 -0.241289 -0.105212 -0.207592 0.219417 -0.016555 0.239057 0.196390 0.306501 0.039207 -0.344493 0.178907 0.359618 -0.079208 -0.042812 -0.044331 -0.231734 -0.085384 0.118397
polarizability: 2.94954760e+02 -6.65453026e+00 1.94784227e+02 -4.58598929e+00 -3.41956561e+00 8.83696784e+01
1716.lowfreq: -5.6192 0.0002 0.0007 0.0007 3.9380 5.6403 43.3570 51.7429 56.9729
frequency: 43.3468 51.7348 56.9262 74.6587 101.2872 114.4468 144.3657 145.2552 166.5370 189.6776 203.2117 206.2068 219.0124 243.0799 263.3439 285.4818 309.0387 328.7527 357.6622 379.4470 415.4206 461.0371 465.8528 491.0735 531.7518 562.5962 570.3319 574.3827 607.6245 633.5935 658.8636 670.6119 720.4154 760.2446 765.4344 780.0405 805.0641 868.7580 886.0799 895.1626 929.7410 942.2815 960.3888 988.6674 1015.5109 1043.1780 1044.1683 1048.5276 1069.2131 1092.2452 1122.5276 1137.7049 1169.9081 1190.4268 1214.8352 1223.0317 1230.1251 1261.5255 1337.5563 1381.4122 1394.0619 1402.0575 1405.9615 1409.2141 1422.1768 1431.7175 1452.1502 1463.8949 1464.3213 1466.1365 1469.1623 1471.4402 1475.7195 1477.5366 1591.4145 1609.7027 1634.1605 1645.5285 1681.1694 2933.1247 2981.7317 2985.6975 2990.4199 2996.2946 3059.2711 3062.8509 3073.7261 3101.3265 3104.2500 3113.9237 3170.9438 3180.2524 3548.1983
redmass: 5.5579 1.9687 1.6144 3.2181 3.3271 1.1698 2.9839 5.2972 1.5858 4.6331 3.3211 1.9240 3.2534 2.0722 1.4071 2.7501 4.3942 5.1378 5.8156 6.5187 5.7524 5.6021 5.9270 3.7164 5.6967 5.2390 4.2473 4.9507 4.6659 4.8003 4.7512 4.4995 6.8378 5.6839 5.3326 6.4782 6.1122 1.4142 2.7709 1.7578 2.9774 4.2494 3.1441 2.1453 1.6274 1.4802 1.4853 1.5790 2.5616 2.5695 4.5591 2.3574 2.5391 1.6175 1.7349 1.6996 1.9721 2.4745 2.1454 2.4301 1.7520 1.3589 1.2941 1.9487 2.5604 2.9539 1.0440 1.0448 1.1973 1.0475 2.9424 1.1478 1.1166 1.3704 8.2243 8.2639 8.1815 8.0864 10.2668 1.0594 1.0379 1.0380 1.1011 1.0371 1.0969 1.0978 1.0971 1.0987 1.0975 1.1003 1.0920 1.0921 1.0663
irintensity: 3.7763 0.8316 1.3954 1.0525 7.8071 0.4370 3.9126 1.5143 0.2208 1.3241 4.5031 2.5398 1.0759 47.6954 92.1852 10.1427 0.8396 0.5184 5.0155 2.1150 2.7236 7.5402 1.5012 1.4884 9.2116 0.3520 2.0366 11.0902 4.1236 6.0302 16.0345 12.8837 0.9636 1.7826 8.6348 17.9555 28.4909 9.6328 74.7781 36.4750 18.5593 55.1513 6.2544 11.7604 29.3266 3.5560 2.2450 8.8849 161.9730 13.4732 19.4627 35.1346 18.5824 35.8653 11.5563 6.8375 7.1424 21.4934 41.3323 51.2919 3.4945 43.2512 20.8109 22.8995 25.3442 9.9928 14.5353 12.8545 8.0815 16.4065 18.5569 29.0919 14.9507 33.6905 69.6390 38.1517 11.8608 41.7251 620.9526 71.6071 12.5267 25.7630 54.9472 14.5024 12.1557 10.7723 10.6230 23.6210 14.0579 7.9922 2.7237 1.3951 4.5027
temp: 298.150 k
press: 1.00000 atm
elementType: 8 8 8 8 6 6 6 6 6 6 6 6 6 6 6 6 6 6 6 1 1 1 1 1 1 1 1 1 1 1 1 1 1
symmnumber: 1
zpe: 664407.9 jmol-1
zpe.correction: 0.253060 hartree
zpe.thermalcorrener: 0.271186 hartree
zpe.thermalcorrenthalpy: 0.272130 hartree
zpe.thermalcorrgfe: 0.206937 hartree
zpe.sumelectzpe: -879.534378 hartree
zpe.sumelectthermal: -879.516252 hartree
zpe.sumelectthermalent: -879.515308 hartree
zpe.sumelectthermalfe: -879.580501 hartree
dipole: 7.2754 4.4036 -1.6660
dipole: 8.6659
quadrupole: -114.8779 -96.0190 -113.3178
quadrupole: -9.0174 -3.5357 -3.2400
quadrupole: -6.8063 12.0526 -5.2462 -9.0174 -3.5357 -3.2400
hfenergy: -879.7874373 hartree
pointgroup: C01 [X(C15H14O4)]
dipole: -2.8500018 1.7563382 0.6457298 debye
polarizability: 294.8967797|6.198188|194.8331725|-6.6329974|1.1660853|88.3787133 unknown
InChI: InChI=1S/C15H14O4/c1-7-4-13(17)19-14-8(2)15-11(5-10(7)14)12(6-16)9(3)18-15/h4-5,16H,6H2,1-3H3
charge 0 multiplicity 1
33 atoms
O  -2.222283 -1.783084 0.070893
O  2.606221 -1.203766 -0.050106
O  -3.14526 2.633807 -0.805233
O  4.894684 -0.937236 -0.113787
C  -1.299728 0.345023 0.1337
C  -1.01601 -1.052958 0.067531
C  0.264206 -1.618705 0.004985
C  -2.754476 0.468742 0.183533
C  1.097568 0.758356 0.06093
C  1.313096 -0.662621 0.008701
C  -0.232207 1.258382 0.117151
C  -3.272672 -0.812614 0.13613
C  2.272562 1.630323 0.038196
C  -3.521624 1.746337 0.320988
C  0.523239 -3.105102 -0.064996
C  -4.650201 -1.385533 0.148094
C  3.535893 1.073747 -0.020613
C  2.097325 3.132509 0.078454
C  3.789715 -0.360686 -0.064701
H  -0.425934 2.333124 0.123998
H  -4.612419 1.543706 0.316133
H  -3.263096 2.238308 1.284509
H  1.061257 -3.366369 -0.99378
H  1.168408 -3.430812 0.77004
H  -0.421996 -3.668986 -0.030176
H  -4.822999 -2.001393 1.050217
H  -5.405924 -0.583587 0.126661
H  -4.8105 -2.036166 -0.730787
H  4.431059 1.701457 -0.037893
H  1.565522 3.446768 0.996125
H  1.497694 3.485495 -0.781376
H  3.071461 3.646799 0.052922
H  -3.601779 3.506638 -0.689443
