program: Gaussian 09
title: 000105082
version: EM64L-G09RevD.01
frameworkgroup: C1[X(C16H26N2O7S)]
method: RPBEPBE
basis: SDD
operation: Freq
keyword: #p
keyword: freq=noraman
keyword: PBEPBE/SDD
title: #p freq=noraman PBEPBE/SDD
converged: YES YES NO NO
title: Mulliken charges:
elementType: S O O O O O O O N N C C C C C C C C C C C C C C C C H H H H H H H H H H H H H H H H H H H H H H H H H H
charge: 0.140580 -0.404304 -0.505779 -0.212591 -0.114378 -0.480595 -0.222319 -0.281362 -0.445648 -0.389273 0.254295 -0.164784 -0.077092 -0.217648 -0.415826 0.089340 -0.196389 -0.033910 -0.693865 -0.714648 -0.696822 -0.694822 -0.107141 0.160831 0.262242 -0.772546 0.270338 0.214480 0.254602 0.340617 0.270784 0.227178 0.177210 0.223231 0.247310 0.220991 0.348789 0.375354 0.222758 0.212267 0.213837 0.217955 0.227067 0.205943 0.322593 0.320456 0.312729 0.349696 0.434579 0.255541 0.253636 0.214514
chargesum: 0.00000
title: Mulliken charges with hydrogens summed into heavy atoms:
elementType: S O O O O O O O N N C C C C C C C C C C C C C C C C
charge: 0.140580 -0.055515 -0.130425 -0.212591 -0.114378 -0.046016 -0.222319 -0.281362 -0.105031 -0.039577 0.254295 0.105554 0.137388 0.036954 0.082136 0.089340 -0.196389 0.143300 -0.002333 -0.065786 -0.045857 -0.051773 0.205588 0.160831 0.262242 -0.048856
polarizability: 2.69518946e+02 -6.19907889e+00 2.20979307e+02 -3.77472155e+00 -1.71383139e+01 1.90651625e+02
1716.lowfreq: -10.1603 0.0012 0.0018 0.0020 3.8875 7.7458 21.1867 28.6944 39.8896
frequency: 20.9297 28.6768 39.8299 42.0435 50.8675 55.4486 60.9453 71.4752 76.8325 84.0852 91.6699 93.9659 122.8351 135.9167 144.1777 153.7772 158.1139 175.9295 190.5485 204.3537 208.6595 212.7133 228.8466 235.4965 255.2844 269.2009 281.4283 285.8381 303.0011 317.1236 323.7232 334.3121 352.7122 360.6967 374.8224 386.5576 403.4700 425.2243 426.6535 463.5768 484.7562 501.7369 517.3467 542.8297 552.6624 574.9631 599.3491 605.3116 629.2585 636.8308 641.6553 661.2571 694.3628 722.6013 737.3503 755.1152 779.1338 799.9581 823.8474 835.8056 858.6884 860.4234 883.6750 903.5700 914.1259 918.7992 940.6807 956.4284 957.3404 968.3269 970.0328 982.2340 989.0380 1037.7790 1043.3507 1051.4290 1067.6876 1087.3395 1110.7202 1117.9570 1121.7468 1138.9049 1145.5512 1147.2894 1181.0673 1196.9765 1197.9119 1222.3731 1223.0159 1234.0458 1242.8493 1246.0726 1273.8388 1285.2599 1288.9268 1293.6258 1304.8604 1316.6049 1326.2385 1338.4779 1339.3997 1359.9197 1369.5056 1378.3350 1381.9054 1388.5308 1397.3651 1400.9398 1419.2736 1424.7920 1448.7096 1450.2243 1462.5716 1463.7735 1469.2652 1471.9653 1475.7120 1479.1472 1480.5267 1487.9787 1606.2199 1633.9301 1659.1301 1670.2405 2918.6529 2935.5338 2956.2664 2972.5843 2977.1108 2977.9821 2998.8531 2999.7399 3004.2134 3027.8941 3041.9617 3056.9001 3066.8096 3070.2249 3075.6247 3087.1598 3098.0473 3098.6475 3102.9818 3104.5640 3108.6158 3132.9414 3521.0657 3529.9870 3549.3974 3551.1213
redmass: 5.3219 3.1183 3.6493 6.6354 4.7673 4.5045 6.0180 4.6197 2.7526 1.5608 4.8044 4.5746 4.9293 1.2086 3.7061 6.8262 4.8971 4.5687 5.3259 1.4447 2.3630 3.7263 4.7466 2.7836 1.4825 3.1634 4.3852 3.1424 3.4484 1.6089 2.1279 3.5333 4.2655 4.4243 8.3998 1.8120 2.0593 1.8356 4.1169 5.2209 4.2392 5.3983 3.8433 4.0346 6.0296 3.4901 3.6435 2.7898 2.4341 1.8959 3.5996 1.6215 3.9913 4.1456 5.0578 3.2795 3.7741 1.9914 2.9861 3.2836 1.6559 2.7190 2.8859 3.0246 2.1487 1.1943 4.1048 2.2757 1.5277 2.1156 2.6015 3.1982 1.5706 1.7053 1.6550 2.5409 2.7696 2.4231 1.8852 1.8970 1.7797 2.6175 3.2624 2.5785 1.8221 1.5411 1.9486 1.5924 1.5262 1.2635 1.5183 1.6041 1.2060 1.4325 1.5006 1.6413 1.9951 1.3726 1.3571 1.3834 1.3441 1.6397 1.5076 1.1637 1.2091 1.2340 1.1923 1.2160 1.0803 1.4160 1.1071 1.0486 1.2216 1.0431 1.0478 1.0562 1.0499 1.6798 1.0506 1.0567 6.7188 10.7680 8.8582 9.4376 1.0720 1.0832 1.0842 1.0355 1.0816 1.0364 1.0359 1.0620 1.0359 1.0813 1.0612 1.1007 1.0999 1.0997 1.0993 1.0985 1.0981 1.0887 1.1002 1.1007 1.0998 1.1070 1.0785 1.0662 1.0784 1.0649
irintensity: 0.5771 0.2358 0.1699 3.0027 1.8997 0.9188 1.1452 0.3855 10.1470 0.4557 2.7766 0.4424 2.5835 2.5077 1.1055 3.9647 7.9883 3.9777 0.0187 0.3412 2.3317 1.6143 8.9319 3.4447 2.1888 12.8983 24.8776 39.1840 5.0539 66.3223 110.0813 33.2415 9.0339 13.0328 1.6492 103.2845 97.3726 6.9241 17.5573 1.8223 2.2864 9.8454 29.4456 6.0976 20.8193 17.5139 40.9153 4.7085 18.2870 20.8749 19.3748 15.1296 55.0556 40.7440 6.0958 10.3145 57.0837 170.0395 46.2497 21.6593 111.4744 88.6924 43.4009 68.4937 22.1086 3.7961 11.5565 11.0701 1.3677 34.6546 39.8554 20.0078 0.3945 29.6992 16.6195 8.5029 91.6593 49.1721 8.5567 14.5251 22.6222 3.2760 27.7073 65.6735 9.8321 70.1717 12.2766 92.3311 38.8570 0.5356 36.1680 26.5838 7.5985 75.5689 5.4115 64.1706 29.1963 5.6525 2.7924 2.1564 15.9904 48.4753 24.9905 19.2257 15.7843 71.6175 21.9977 11.0199 37.8612 21.3381 10.7191 13.7580 179.6383 2.0103 16.3357 10.3138 8.6689 216.8590 28.3984 13.4367 174.5283 19.7662 292.3357 425.9461 983.4595 59.4644 12.0833 30.6282 14.4223 29.7246 8.8073 5.5117 21.3631 5.1900 2.1232 6.2287 15.2893 31.7351 75.2254 39.8817 9.3712 6.9856 18.1164 17.7911 19.5573 3.6705 46.9658 9.3420 53.2576 16.0826
temp: 298.150 k
press: 1.00000 atm
elementType: 16 8 8 8 8 8 8 8 7 7 6 6 6 6 6 6 6 6 6 6 6 6 6 6 6 6 1 1 1 1 1 1 1 1 1 1 1 1 1 1 1 1 1 1 1 1 1 1 1 1 1 1
symmnumber: 1
zpe: 1088466.6 jmol-1
zpe.correction: 0.414575 hartree
zpe.thermalcorrener: 0.444300 hartree
zpe.thermalcorrenthalpy: 0.445244 hartree
zpe.thermalcorrgfe: 0.352968 hartree
zpe.sumelectzpe: -1657.433290 hartree
zpe.sumelectthermal: -1657.403565 hartree
zpe.sumelectthermalent: -1657.402621 hartree
zpe.sumelectthermalfe: -1657.494897 hartree
dipole: -3.7508 -0.0227 3.7909
dipole: 5.3329
quadrupole: -164.6975 -178.3384 -171.2236
quadrupole: -8.7264 13.5279 7.8233
quadrupole: 6.7223 -6.9186 0.1963 -8.7264 13.5279 7.8233
hfenergy: -1657.8478649 hartree
pointgroup: C01 [X(C16H26N2O7S1)]
dipole: -1.4655483 0.0366692 -1.5009799 debye
polarizability: 269.5034529|6.0966395|221.4606467|4.346854|-16.6353309|190.1857782 unknown
InChI: InChI=1S/C16H26N2O7S/c1-7(2)5-11(20)16(12(21)8(3)13(22)18-16)15(25)26-6-10(14(23)24)17-9(4)19/h7-8,10-12,17-18,20-21,23H,5-6H2,1-4H3
charge 0 multiplicity 1
52 atoms
S  1.221351 1.50257 0.84929
O  -2.294297 2.164906 2.152179
O  -1.007214 -0.921699 -1.593336
O  -2.239323 3.60206 -1.848851
O  -0.376784 -0.335571 2.128762
O  1.560304 -1.098308 -1.15374
O  1.426543 -2.487472 0.710831
O  5.63105 0.453215 1.015226
N  -1.220494 1.751336 -0.792308
N  3.858151 -0.024544 -0.39647
C  -1.504926 0.728016 0.23313
C  -2.730622 1.381981 1.002275
C  -1.955812 -0.61843 -0.48373
C  -3.429758 2.241749 -0.094082
C  -2.106438 -1.87125 0.389798
C  -2.266405 2.654256 -1.025876
C  -0.326347 0.485474 1.198158
C  -3.11429 -2.922335 -0.155549
C  -4.265057 3.432618 0.402993
C  -3.351941 -4.005136 0.925003
C  -2.658443 -3.577914 -1.481076
C  2.471474 0.342125 1.677944
C  3.090161 -0.676315 0.667179
C  1.969986 -1.548005 0.090301
C  5.113598 0.502125 -0.145143
C  5.824638 1.128178 -1.338639
H  -3.382483 0.61147 1.439228
H  -2.932133 -0.383816 -0.960847
H  -4.089805 1.57604 -0.688352
H  -0.297313 1.860032 -1.221479
H  -1.114276 -2.338214 0.538558
H  -2.438366 -1.556094 1.396766
H  -4.082844 -2.404806 -0.338933
H  -5.155121 3.084798 0.95466
H  -4.589738 4.037889 -0.460437
H  -3.685017 4.083048 1.07809
H  -1.690272 2.896965 1.860409
H  -1.096423 -0.217821 -2.286021
H  -2.407959 -4.532721 1.158902
H  -3.734561 -3.566085 1.86547
H  -4.082612 -4.757731 0.576209
H  -1.692331 -4.098404 -1.340013
H  -2.519053 -2.836286 -2.285955
H  -3.401986 -4.323969 -1.818548
H  1.933796 -0.180629 2.487239
H  3.271135 0.978083 2.085678
H  3.769395 -1.312622 1.265339
H  3.412835 0.0374 -1.31446
H  0.576381 -1.313434 -1.361708
H  6.765025 0.580539 -1.5242
H  6.097269 2.168706 -1.092951
H  5.221054 1.122131 -2.262313
