program: Gaussian 09
title: 000104890
version: EM64L-G09RevD.01
frameworkgroup: C1[X(C4H6N2O3S)]
method: RPBEPBE
basis: SDD
operation: Freq
keyword: #p
keyword: freq=noraman
keyword: PBEPBE/SDD
title: #p freq=noraman PBEPBE/SDD
converged: YES YES NO NO
title: Mulliken charges:
elementType: S O O O N N C C C C H H H H H H
charge: 0.202055 -0.414139 -0.202434 -0.251502 -0.047865 0.071364 -0.152511 -0.695524 -0.628899 0.207995 0.313382 0.300640 0.288828 0.296612 0.319583 0.392414
chargesum: 0.00000
title: Mulliken charges with hydrogens summed into heavy atoms:
elementType: S O O O N N C C C C
charge: 0.202055 -0.021724 -0.202434 -0.251502 -0.047865 0.071364 0.160871 -0.106056 -0.012704 0.207995
polarizability: 9.73210546e+01 1.09175886e+01 7.71930851e+01 -7.45567992e+00 2.16352640e+00 7.10953263e+01
1716.lowfreq: -16.3947 -11.8227 -0.0017 -0.0016 0.0012 7.4287 45.4623 55.0152 71.9727
frequency: 45.4413 54.8834 71.9681 143.4270 222.5721 248.2064 315.4034 355.5358 378.2083 460.2053 488.6913 567.9325 607.2489 623.9916 646.9504 688.7844 779.4017 808.3996 857.7112 915.8488 947.8076 983.4878 997.7481 1043.7443 1125.1867 1168.5428 1210.2794 1217.2775 1257.6542 1265.3606 1297.9493 1332.0669 1374.8972 1453.2445 1459.6549 1675.3906 3045.6605 3049.4606 3059.2090 3129.1344 3145.8203 3523.0063
redmass: 10.4045 7.4367 8.0741 4.3427 4.0565 4.3996 7.5782 7.1747 5.9037 8.4004 4.3661 4.0223 1.7202 6.6238 3.4074 3.9658 3.8984 3.5723 4.1455 1.5493 1.7716 2.4941 2.5972 2.3029 1.3809 1.4166 1.5492 1.4921 1.4167 1.4908 1.9754 2.3575 5.3547 1.0897 1.0910 9.6637 1.0785 1.0534 1.0630 1.1112 1.1086 1.0644
irintensity: 1.7874 2.6450 1.6817 7.3527 2.4829 1.7971 2.0395 2.2359 12.9622 1.3366 13.1790 49.5892 99.0941 13.0090 12.5110 47.1691 8.1443 37.3532 2.8280 43.4387 10.2873 76.9054 131.0667 275.2380 11.5026 21.1413 31.1072 5.5396 16.1927 43.9812 27.2844 17.1267 129.8727 13.2715 12.0147 186.2657 7.6486 6.5965 12.4163 3.8797 2.3775 37.0311
temp: 298.150 k
press: 1.00000 atm
elementType: 16 8 8 8 7 7 6 6 6 6 1 1 1 1 1 1
symmnumber: 1
zpe: 287363.3 jmol-1
zpe.correction: 0.109451 hartree
zpe.thermalcorrener: 0.119293 hartree
zpe.thermalcorrenthalpy: 0.120237 hartree
zpe.thermalcorrgfe: 0.072745 hartree
zpe.sumelectzpe: -888.419507 hartree
zpe.sumelectthermal: -888.409665 hartree
zpe.sumelectthermalent: -888.408721 hartree
zpe.sumelectthermalfe: -888.456212 hartree
dipole: 3.8890 1.1328 -1.2177
dipole: 4.2297
quadrupole: -65.4105 -71.6794 -64.9187
quadrupole: -6.6282 -3.3645 0.2071
quadrupole: 1.9257 -4.3432 2.4175 -6.6282 -3.3645 0.2071
hfenergy: -888.5289576 hartree
pointgroup: C01 [X(C4H6N2O3S1)]
dipole: -1.2319603 -1.080286 0.2905999 debye
dipolederiv: -0.1484975 -0.0385342 0.0127256 -0.0516847 -0.2171032 -0.0074495 0.0361727 -0.0706248 -0.1112355 -1.0924535 -0.4386308 -0.0841825 -0.3845471 -0.5842644 0.027466 0.0041902 0.0638155 -0.3235665 -0.6044418 -0.007945 0.1294261 -0.1468237 -0.6509857 -0.2214045 0.0272091 -0.3600712 -0.5540562 -0.7651807 -0.662312 0.6176017 -0.2638224 -0.5164566 0.3451372 -0.080734 -0.0175959 -0.2422966 -0.3561066 -0.1828229 0.1592407 -0.2335878 -0.6293534 0.2751939 0.492163 0.5219208 -0.6691248 0.5795369 0.8170836 -0.7421771 0.5290526 0.5799121 -0.6834115 -0.4784335 -0.5783118 0.6419462 0.3028884 0.1783784 -0.132586 0.1630957 0.2894176 -0.1982326 0.0548126 0.0037017 -0.0649942 0.1167556 0.071436 0.0966283 -0.0204052 -0.0324409 0.1094786 0.1434841 0.1164311 0.1612749 0.0705064 -0.1460308 0.0769039 -0.0078671 0.4417945 0.048931 -0.0346423 0.0011282 0.1488142 1.3609098 0.351093 -0.1747662 0.4210834 0.8344056 0.3742326 -0.2585598 0.459058 0.6741031 0.0454028 0.017389 -0.0159631 0.0556571 0.1112931 0.0423927 -0.0767416 -0.0014554 0.0494662 0.0167305 -0.0839793 -0.0175072 -0.0801978 0.0523037 0.0440148 0.0001088 0.0281806 0.0645229 0.0040548 0.0294445 0.0002484 0.0488331 0.0468579 -0.0280707 -0.0252133 -0.0822163 -0.1006228 0.0216131 0.01633 -0.0223557 -0.0676431 0.0516561 0.0024815 0.0718789 0.0168018 0.1070832 0.1244522 0.0550582 0.0248987 -0.0134596 -0.069234 -0.0188597 0.0167009 0.0017182 -0.0062838 0.3238296 0.0240425 0.0718644 0.0523166 0.2921975 -0.1118997 0.107604 -0.1024805 0.2249699 unknown
polarizability: 86.7224587|15.0708046|84.2498758|-2.780894|-9.6014612|74.6371315 unknown
InChI: InChI=1S/C4H6N2O3S/c7-4(8)3-1-10-2-6(3)5-9/h3,7H,1-2H2
charge 0 multiplicity 1
16 atoms
S  1.416928 -1.795019 0.871965
O  -2.622318 -0.827972 0.352025
O  -1.382432 0.899213 1.29991
O  2.245631 1.673718 -1.623163
N  0.735253 0.419637 -0.515781
N  1.096859 1.118563 -1.676741
C  -0.463426 -0.418293 -0.606568
C  0.022375 -1.883274 -0.426468
C  1.639714 0.096804 0.588636
C  -1.492376 -0.013458 0.460992
H  -0.918119 -0.269455 -1.602366
H  -0.772509 -2.541353 -0.049775
H  0.436337 -2.268248 -1.370509
H  2.671232 0.34357 0.292206
H  1.343807 0.614438 1.512474
H  -3.298156 -0.56227 1.032662
