program: Gaussian 09
title: 000008445
version: EM64L-G09RevD.01
frameworkgroup: C1[X(C8H11NO)]
method: RPBEPBE
basis: SDD
operation: Freq
keyword: #p
keyword: freq=noraman
keyword: PBEPBE/SDD
title: #p freq=noraman PBEPBE/SDD
converged: YES YES NO NO
title: Mulliken charges:
elementType: O N C C C C C C C C H H H H H H H H H H H
charge: -0.308392 -0.696121 0.513133 0.334384 0.187062 -0.527056 -0.488938 -0.314327 -0.821064 -0.531997 0.218710 0.224288 0.229834 0.224161 0.221827 0.223941 0.298459 0.333536 0.220890 0.220877 0.236793
chargesum: 0.00000
title: Mulliken charges with hydrogens summed into heavy atoms:
elementType: O N C C C C C C C C
charge: -0.308392 -0.064127 0.513133 0.334384 0.187062 -0.308346 -0.264649 -0.084494 -0.151134 0.146563
polarizability: 1.34559975e+02 -3.42306342e+00 1.09690196e+02 5.26299052e-03 3.80504474e-03 5.10302886e+01
1716.lowfreq: -2.6294 -0.0003 0.0005 0.0006 11.6442 13.2348 57.6956 82.4966 146.9916
frequency: 57.6483 82.4922 146.9897 207.0641 208.6203 238.8332 280.9540 321.1378 344.5419 371.8844 440.7027 461.2186 484.6378 496.9678 573.3237 596.0743 694.4111 730.5553 741.9287 782.2208 853.7805 899.8468 942.9204 985.7293 1002.9915 1045.1882 1053.2744 1117.0334 1142.2311 1154.7806 1180.9253 1209.6996 1285.8020 1318.2845 1394.1856 1406.1056 1437.8414 1448.9920 1464.0521 1470.8364 1476.5880 1481.1014 1517.9443 1601.4561 1611.1855 1632.2402 2955.5745 2970.1396 3040.7628 3045.2799 3079.9365 3109.9887 3117.8041 3130.1490 3157.9223 3568.2633 3717.0142
redmass: 1.0867 2.7874 3.3587 3.1266 3.4249 1.1529 2.7895 1.3148 3.4340 2.8743 2.6257 4.6889 1.1038 3.7994 4.7481 3.5848 4.7847 3.3101 5.5123 1.3337 1.5050 1.3458 2.6929 2.0892 3.3417 1.5267 1.5151 1.2599 1.4050 1.7211 1.9158 2.3434 1.4770 2.5496 1.3943 3.8141 1.1603 3.4991 1.0501 1.0464 1.0581 1.1852 3.3032 1.9212 3.3442 3.0229 1.0328 1.0372 1.1037 1.0977 1.0982 1.0910 1.0993 1.0881 1.0949 1.0441 1.1046
irintensity: 0.9301 7.3199 0.8116 4.4458 6.8330 0.7210 4.0816 162.4354 0.1667 78.6053 7.8359 3.8440 73.8492 3.1451 3.8474 4.9405 4.8403 0.0805 6.5482 55.0266 21.0245 1.4527 8.1190 19.9153 24.8625 13.4447 2.9228 0.2206 40.5869 44.8480 23.7462 141.2214 1.8229 41.6693 15.2142 3.2654 3.6997 8.1790 12.9213 11.9942 40.2588 20.2948 155.8843 7.5628 16.3764 246.9942 74.7852 51.5479 51.3604 28.5284 21.7001 26.6957 29.2533 11.4174 16.2863 71.2992 32.2634
temp: 298.150 k
press: 1.00000 atm
elementType: 8 7 6 6 6 6 6 6 6 6 1 1 1 1 1 1 1 1 1 1 1
symmnumber: 1
zpe: 456315.9 jmol-1
zpe.correction: 0.173802 hartree
zpe.thermalcorrener: 0.184220 hartree
zpe.thermalcorrenthalpy: 0.185164 hartree
zpe.thermalcorrgfe: 0.138279 hartree
zpe.sumelectzpe: -440.666500 hartree
zpe.sumelectthermal: -440.656082 hartree
zpe.sumelectthermalent: -440.655138 hartree
zpe.sumelectthermalfe: -440.702023 hartree
dipole: -1.2329 0.3235 -0.0042
dipole: 1.2746
quadrupole: -50.3830 -48.8526 -64.9575
quadrupole: 3.6909 0.0074 -0.0171
quadrupole: 4.3480 5.8785 -10.2265 3.6909 0.0074 -0.0171
hfenergy: -440.840302 hartree
pointgroup: C01 [X(C8H11N1O1)]
dipole: 0.484986 -0.1273815 -0.0056302 debye
dipolederiv: -1.6345815 -0.2817482 -0.0076455 -0.1807409 -0.4125816 -0.0033582 -0.004783 -0.0033351 -0.2952736 -0.4646056 0.5559431 0.0162337 0.599504 -1.1696838 -0.0119404 0.0168807 -0.0107856 -0.7382343 0.30197 -0.1007177 -0.0034122 0.1944348 0.1774498 0.005691 0.0036146 0.0058898 -0.0200634 0.1132515 -0.6085679 -0.0177535 -0.7893945 1.1774321 0.0307829 -0.023004 0.0309561 0.129516 1.3162149 -0.0153938 -0.0009151 0.1873402 -0.3100876 -0.0090796 0.0050502 -0.0092857 -0.0000635 -0.1707978 0.408985 0.0118175 -0.0014747 -0.1050105 0.0047316 0.000073 0.0045829 -0.2723109 -0.2957313 0.0744169 0.0021571 -0.1398424 -0.0950255 0.0047051 -0.0040496 0.0046983 -0.2481225 0.0267699 -0.1067531 -0.0032225 0.0310435 0.0684724 0.0063933 0.0009277 0.0064582 -0.1596088 -0.0768832 0.0086025 0.000457 -0.0547896 0.0847399 0.0000662 0.0004585 -0.0000448 0.0829536 0.6026771 0.1753752 0.0049443 0.4906586 0.45655 0.0032975 0.0142057 0.0034465 0.3336894 0.0138236 -0.0923385 -0.0026769 -0.0991841 -0.0955523 -0.0075782 -0.0029418 -0.0076487 0.1655536 0.0116285 0.0972761 0.0028685 0.0916982 -0.0800369 -0.0073076 0.0026924 -0.0072992 0.167489 0.0144816 -0.1091601 -0.0030888 -0.1169143 -0.0351343 -0.0055806 -0.0033677 -0.0055257 0.1602202 -0.0425576 -0.0238854 0.0571936 -0.0673669 0.0412008 0.1076772 0.1316219 0.0857561 -0.0509605 0.0454074 0.0194611 0.0004033 0.1377168 -0.1348093 -0.005604 0.003188 -0.0057856 0.1043502 -0.0418702 -0.021198 -0.0580463 -0.0614323 0.0496873 -0.1031829 -0.1348812 -0.0810398 -0.0592997 0.1189267 -0.0311937 -0.0010225 -0.0444965 0.1975719 -0.005801 -0.0011956 -0.0066844 0.3844476 0.2151618 -0.0430822 -0.0010684 0.0039263 0.2248828 -0.0049366 0.0006803 -0.0053266 0.386582 0.0552216 0.0335507 0.0668725 -0.1304671 -0.0466932 -0.1047359 -0.0127578 -0.114011 -0.1023383 0.0551128 0.0372675 -0.0647482 -0.1311076 -0.0595034 0.1073085 0.0052629 0.1165368 -0.0896758 -0.16362 0.0231604 0.0006526 0.0808886 0.0661316 -0.0015483 0.0023249 -0.0015527 0.1211498 unknown
polarizability: 134.5566692|-3.4321463|109.6433075|-0.1463884|1.7148096|51.0804826 unknown
InChI: InChI=1S/C8H11NO/c1-6-3-4-8(10-2)7(9)5-6/h3-5H,9H2,1-2H3
charge 0 multiplicity 1
21 atoms
O  2.311533 -0.103196 -0.007399
N  0.813594 -2.308004 -0.071385
C  -1.923909 0.27775 0.005389
C  0.139998 -1.089556 -0.035466
C  0.911828 0.116865 -0.000416
C  -1.272089 -0.982683 -0.031757
C  -1.136651 1.451016 0.039114
C  0.280459 1.371035 0.036183
C  -3.44268 0.351893 0.008921
C  3.168361 1.078678 0.02678
H  -1.872474 -1.901934 -0.058415
H  -1.621517 2.43307 0.068012
H  0.87111 2.292437 0.062409
H  -3.872071 -0.165902 0.887977
H  -3.791767 1.398715 0.033432
H  -3.87435 -0.125029 -0.891831
H  0.307414 -3.186545 -0.098969
H  1.829627 -2.305329 -0.072531
H  2.999083 1.670153 0.94812
H  2.999391 1.722151 -0.859088
H  4.199912 0.695616 0.015921
