program: Gaussian 09
title: 000104879
version: EM64L-G09RevD.01
frameworkgroup: C1[X(C23H27NO9)]
method: RPBEPBE
basis: SDD
operation: Freq
keyword: #p
keyword: freq=noraman
keyword: PBEPBE/SDD
title: #p freq=noraman PBEPBE/SDD
converged: NO YES NO NO
title: Mulliken charges:
elementType: O O O O O O O O O N C C C C C C C C C C C C C C C C C C C C C C C H H H H H H H H H H H H H H H H H H H H H H H H H H H
charge: -0.272627 -0.456590 -0.256253 -0.231339 -0.447725 -0.461731 -0.471058 -0.471073 -0.172703 -0.092232 0.239950 -0.226908 -0.167370 -0.281701 -0.467723 -0.017989 -0.544019 -0.421643 0.397961 -0.105397 -0.246059 0.091211 -0.247679 -0.412837 -0.645122 0.221226 -0.368477 -0.029135 -0.093630 -0.146418 -0.156785 -0.088074 0.155022 0.244793 0.218247 0.247164 0.201809 0.245752 0.218235 0.223742 0.227750 0.176738 0.226023 0.221200 0.245187 0.234237 0.194000 0.227111 0.222625 0.254034 0.374763 0.214971 0.247545 0.220498 0.249239 0.243224 0.365781 0.368998 0.382201 0.399058
chargesum: 0.00000
title: Mulliken charges with hydrogens summed into heavy atoms:
elementType: O O O O O O O O O N C C C C C C C C C C C C C C C C C C C C C C C
charge: -0.272627 -0.081826 -0.256253 -0.231339 -0.081944 -0.092732 -0.088857 -0.072015 -0.172703 -0.092232 0.239950 0.017885 0.050877 -0.034537 -0.020162 -0.017989 -0.102042 -0.017155 0.397961 0.120625 -0.024858 0.091211 -0.002492 -0.178600 -0.001387 0.221226 -0.114442 0.185836 0.153915 0.074081 0.092453 0.155149 0.155022
polarizability: 3.31694062e+02 1.75978183e+01 2.50376356e+02 -1.56368644e+01 1.63569981e+01 2.39963374e+02
1716.lowfreq: -5.7149 -2.4885 -0.0006 0.0004 0.0009 2.1849 10.5104 16.7892 20.9350
frequency: 3.8429 16.5573 20.7782 25.1698 42.1263 57.0732 72.2880 80.2119 97.2478 105.8438 111.3108 137.5381 158.7846 176.9307 181.0778 204.6709 219.3012 226.2024 242.8788 257.1175 266.3842 271.4661 281.2777 290.4753 301.6318 305.3669 316.9303 320.5431 335.4867 354.0935 373.1710 391.8774 395.0766 407.1633 415.1760 416.7107 445.6889 448.7255 450.6707 463.5040 469.6425 490.6492 501.8518 526.2189 527.8267 545.8888 553.8035 558.3426 562.9091 563.1721 587.7743 596.6648 601.8351 617.0530 623.8322 640.8381 660.0570 685.6405 698.5335 718.1499 729.3240 759.1876 773.2401 795.5774 810.0867 831.4692 849.8711 855.3311 881.6659 898.8148 908.0006 919.6000 931.8845 945.1511 957.8157 963.1611 968.9798 969.7671 980.6976 989.0849 1003.7736 1017.5275 1022.0335 1036.6609 1041.7963 1053.3939 1059.0599 1073.2298 1075.3740 1079.4938 1084.8036 1087.4135 1090.7874 1096.5797 1110.3930 1112.4466 1128.0321 1153.1304 1157.9956 1161.2847 1174.4393 1179.6826 1186.5215 1212.5983 1214.7714 1217.3194 1218.3889 1223.2611 1228.2348 1228.9215 1233.8326 1254.7126 1257.3349 1259.7317 1264.4209 1276.0284 1287.1522 1289.7799 1298.3800 1301.9879 1316.7207 1317.8673 1323.5668 1330.4904 1332.0295 1344.9615 1347.5848 1348.9666 1364.1217 1369.9554 1373.0107 1382.7887 1399.1388 1400.2658 1403.3766 1421.3153 1438.6120 1441.4489 1453.6730 1467.1264 1478.9894 1480.9762 1495.4187 1607.0659 1631.3880 1650.8222 1700.7469 2820.8837 2851.2450 2905.5846 2911.6997 2940.6444 2952.9771 2958.5045 2964.0649 2967.1770 2993.2496 2999.5798 3010.1212 3010.8028 3016.5771 3029.3589 3063.2208 3067.3862 3078.8399 3101.5253 3127.0992 3146.1731 3152.9063 3465.0558 3505.6685 3518.0390 3550.8244 3554.3677
redmass: 6.8905 6.3082 9.7342 6.1095 4.8768 7.3075 4.1807 5.2620 7.4908 5.1011 7.3615 5.9980 3.2204 3.3466 3.4512 1.6259 3.7574 2.1544 4.2742 3.8173 4.6584 3.9614 4.9800 4.0821 3.8265 4.4072 5.2159 3.8891 3.6446 5.8705 2.9598 2.8686 2.3039 3.8251 5.6395 2.9026 4.3799 1.8810 1.5990 3.0639 1.5948 2.9989 3.3545 4.0097 4.4220 2.9064 1.3318 3.3765 4.3456 3.7814 3.4486 4.6654 4.7689 1.7833 2.9479 3.5452 2.8430 4.0544 4.2484 4.6766 3.0437 4.9551 3.8644 1.8029 2.2807 4.0707 3.1153 6.6985 3.8234 3.9602 5.6924 3.5282 1.4018 2.1399 2.0346 6.2306 2.6317 2.4344 2.8361 5.5175 2.7495 3.2651 3.8197 4.3748 2.4302 2.7972 2.6146 2.5982 2.1959 3.7408 2.6224 3.1629 3.0955 2.5195 1.4578 1.9741 2.2521 1.5579 1.7395 2.4425 1.1714 1.3217 1.7783 1.6096 1.3210 1.4336 1.3456 1.1830 1.2802 1.5405 1.8155 1.6902 1.5882 1.2073 1.5586 1.3697 1.2714 1.9172 1.2128 1.5948 1.3329 1.4782 1.4606 1.2666 1.3642 1.4168 1.3850 1.5148 1.2919 1.4496 1.5188 1.8134 4.2877 1.5624 1.8978 3.9247 1.1748 1.1793 1.0929 1.0518 1.0701 3.1708 1.0816 9.9451 8.5515 7.8480 9.8946 1.0721 1.0578 1.0833 1.0797 1.0837 1.0820 1.0804 1.0676 1.0827 1.0631 1.0850 1.0720 1.0852 1.0852 1.0945 1.1008 1.1004 1.0889 1.0868 1.0877 1.0980 1.0960 1.0649 1.0652 1.0639 1.0656 1.0654
irintensity: 0.7906 1.2887 2.6255 0.1035 0.3959 0.5003 0.2776 1.1085 2.4578 2.1652 0.8882 1.5754 1.2952 5.4541 3.4570 0.9906 8.6773 0.7312 1.9828 4.7318 6.4062 8.0785 0.2451 2.5698 0.8312 6.6743 9.2158 1.1135 11.6489 7.2724 8.5261 13.8846 75.2228 22.9985 1.0543 19.5558 6.0426 56.1645 115.9842 7.2969 69.4233 22.2860 7.5638 7.5420 19.8785 5.6617 151.9873 10.1762 4.0547 20.3497 62.3064 12.0532 31.0944 107.6994 12.5918 4.6256 47.6961 22.0707 11.4259 2.1393 3.6774 23.5636 35.7440 27.8296 32.7245 4.2196 5.9149 11.1505 9.6116 62.0921 132.2115 10.9171 4.5587 2.5622 22.6638 37.9277 212.4361 222.3397 16.4470 137.7508 37.4753 29.7139 136.2018 34.2537 30.5797 84.8751 16.7812 17.1363 40.7407 10.7681 21.8640 12.2043 28.1035 168.1382 3.3412 5.4865 35.2165 45.1010 19.5595 55.1228 0.5360 13.9398 6.3291 13.8772 20.6935 8.3653 60.3513 23.9431 17.6930 5.8334 20.5781 6.9660 11.7742 10.1547 23.2122 8.6917 10.4223 9.2412 43.0843 14.7752 39.2692 12.3072 1.5553 36.7579 4.0776 2.2610 14.3781 26.1408 71.7202 18.8023 12.6647 6.7605 15.4086 13.7658 16.8363 22.6096 3.8862 32.1308 11.5170 16.8712 12.0090 63.1902 6.8815 17.4987 6.2487 2.0900 203.7654 92.0368 196.3340 68.8437 20.6578 12.9812 36.7251 46.9596 50.6027 19.4607 22.1223 9.3777 39.3397 64.0641 48.8226 24.5782 18.6415 33.0171 32.6956 10.5793 11.7998 17.7371 8.7669 44.4420 85.5014 21.2632 18.2521 28.5058
temp: 298.150 k
press: 1.00000 atm
elementType: 8 8 8 8 8 8 8 8 8 7 6 6 6 6 6 6 6 6 6 6 6 6 6 6 6 6 6 6 6 6 6 6 6 1 1 1 1 1 1 1 1 1 1 1 1 1 1 1 1 1 1 1 1 1 1 1 1 1 1 1
symmnumber: 1
zpe: 1243377.5 jmol-1
zpe.correction: 0.473577 hartree
zpe.thermalcorrener: 0.503214 hartree
zpe.thermalcorrenthalpy: 0.504158 hartree
zpe.thermalcorrgfe: 0.410787 hartree
zpe.sumelectzpe: -1621.851350 hartree
zpe.sumelectthermal: -1621.821714 hartree
zpe.sumelectthermalent: -1621.820770 hartree
zpe.sumelectthermalfe: -1621.914141 hartree
dipole: 0.8029 4.9027 -2.6117
dipole: 5.6127
quadrupole: -154.5218 -183.9171 -199.1078
quadrupole: -12.9651 -6.9903 10.7436
quadrupole: 24.6604 -4.7348 -19.9255 -12.9651 -6.9903 10.7436
hfenergy: -1622.324928 hartree
pointgroup: C01 [X(C23H27N1O9)]
dipole: -0.3125625 -2.1854987 0.0446249 debye
polarizability: 331.3632697|23.4616492|233.9742636|6.5648763|-12.440832|256.6962586 unknown
InChI: InChI=1S/C23H27NO9/c1-24-7-6-23-10-3-4-12(25)20(23)32-18-13(5-2-9(14(18)23)8-11(10)24)31-22-17(28)15(26)16(27)19(33-22)21(29)30/h2-5,10-12,15-17,19-20,22,25-29H,6-8H2,1H3
charge 0 multiplicity 1
60 atoms
O  -0.562569 0.909239 1.269366
O  -1.502066 3.068701 2.51415
O  1.573381 1.451087 -0.752688
O  2.628728 -0.276151 0.410895
O  4.047793 1.989902 -2.199235
O  6.361657 1.291411 -0.649945
O  6.262637 -1.298495 0.537515
O  4.63407 -2.530532 2.33745
O  2.325067 -2.512558 2.084863
N  -4.557241 -1.929976 -0.531105
C  -2.752328 -0.125339 0.792345
C  -4.197691 0.353511 0.463026
C  -4.658336 -0.459516 -0.79373
C  -1.965281 0.716833 1.845752
C  -2.779254 -1.652954 1.170765
C  -1.92533 0.139809 -0.462249
C  -3.839209 -0.116347 -2.073372
C  -4.127229 -2.31967 0.822536
C  -2.353729 0.063629 -1.794902
C  -2.564346 2.131845 2.143075
C  -4.232899 1.859097 0.27358
C  -0.664256 0.642949 -0.110523
C  -3.447423 2.670135 1.027505
C  -1.387439 0.34193 -2.800374
C  -5.686028 -2.706647 -1.061518
C  0.302054 0.90412 -1.095341
C  -0.072552 0.72834 -2.451591
C  2.67393 0.547351 -0.83391
C  3.976068 1.357973 -0.883764
C  5.182192 0.424896 -0.690475
C  5.076692 -0.441642 0.571826
C  3.739581 -1.229111 0.492218
C  3.434869 -2.127421 1.69278
H  -4.877565 0.08295 1.298268
H  -5.721973 -0.187908 -0.988221
H  -1.789325 0.179502 2.790147
H  -2.595352 -1.776282 2.255448
H  -1.964173 -2.171982 0.637213
H  -4.21936 0.826592 -2.520694
H  -4.017113 -0.915213 -2.817533
H  -4.000555 -3.418966 0.83684
H  -4.891228 -2.083989 1.609734
H  -3.186161 2.033832 3.057116
H  -4.908308 2.278819 -0.48408
H  -3.460355 3.76146 0.921291
H  -1.670198 0.295439 -3.858349
H  -6.648908 -2.52919 -0.517441
H  -5.457929 -3.786819 -1.005533
H  -5.851895 -2.455566 -2.125347
H  0.663347 0.969926 -3.226852
H  -0.692246 2.801569 1.997092
H  2.588595 -0.12983 -1.713909
H  3.95996 2.111137 -0.069865
H  5.249487 -0.261875 -1.564587
H  5.063119 0.198295 1.478204
H  3.776976 -1.887783 -0.409105
H  4.933332 2.433689 -2.259341
H  7.147778 0.713222 -0.471637
H  6.223847 -1.889726 1.336131
H  4.412796 -3.134304 3.097186
