program: Gaussian 09
title: 000104697
version: EM64L-G09RevD.01
frameworkgroup: C1[X(C11H18N2O)]
method: RPBEPBE
basis: SDD
operation: Freq
keyword: #p
keyword: freq=noraman
keyword: PBEPBE/SDD
title: #p freq=noraman PBEPBE/SDD
converged: YES YES NO NO
title: Mulliken charges:
elementType: O N N C C C C C C C C C C C H H H H H H H H H H H H H H H H H H
charge: -0.460477 -0.305113 -0.303981 -0.369714 -0.372515 -0.482164 -0.344342 0.424035 -0.322603 -0.381528 -0.440175 -0.223314 -0.222167 -0.243615 0.194525 0.203927 0.198820 0.205966 0.222147 0.195614 0.250711 0.239051 0.205413 0.223304 0.209470 0.177178 0.270693 0.231298 0.223625 0.223644 0.226218 0.346067
chargesum: 0.00000
title: Mulliken charges with hydrogens summed into heavy atoms:
elementType: O N N C C C C C C C C C C C
charge: -0.114410 -0.054402 -0.064930 0.028739 0.032270 -0.064403 0.084375 0.424035 0.064044 -0.110835 -0.208877 0.000311 0.001478 -0.017396
polarizability: 1.89764927e+02 -5.21035468e+00 1.28166089e+02 1.05033774e+01 4.15884082e+00 8.74459283e+01
1716.lowfreq: -6.6792 -2.9349 -0.0006 -0.0006 -0.0004 8.2373 19.2043 35.4049 39.8159
frequency: 19.0443 35.3649 39.6440 49.9467 87.1705 103.5959 107.3142 141.1590 163.8967 194.1049 205.8886 257.4917 261.1449 330.8430 383.0106 405.5544 444.8865 480.7323 518.6945 599.2898 616.7543 687.5092 698.5011 708.2038 748.1093 807.2756 813.5432 832.2283 858.5377 914.3194 964.3931 973.7288 981.0167 989.6163 996.2825 1005.4901 1020.7795 1025.4221 1037.1161 1073.7992 1078.9931 1081.6371 1141.0001 1142.6255 1155.4896 1160.9986 1169.5970 1180.2447 1207.2252 1212.7295 1231.6700 1241.5378 1269.2583 1276.3610 1288.7353 1312.7759 1332.9971 1358.7544 1383.5695 1395.2853 1419.2539 1439.9056 1448.3114 1460.9678 1475.4775 1477.3895 1483.3496 1487.9445 1494.9847 1499.3597 1593.9259 1614.9060 2860.1059 2885.7496 2897.5309 2902.8532 2927.9018 2967.3051 2973.6961 3001.1491 3002.3058 3039.7354 3111.9860 3123.0442 3136.4737 3150.4514 3162.3291 3419.3964 3433.6178 3576.6218
redmass: 4.4448 3.9993 2.2328 4.0288 3.3960 2.3199 2.6456 2.5246 2.4865 5.6591 4.0429 1.1387 2.6889 3.8535 4.4502 2.8535 3.1242 3.2485 4.3861 4.5487 6.2939 1.3554 1.3409 1.7384 1.5625 2.0363 1.4769 1.1394 1.2475 1.3424 2.5598 3.4154 1.3938 6.1279 1.3815 2.5697 2.3885 2.1588 2.3558 1.5168 1.6076 2.4700 1.6657 2.9572 4.0497 1.1120 1.0593 1.1107 1.2821 2.4292 1.4462 1.2820 1.1274 1.1254 1.2661 1.3130 1.3030 1.5039 3.0737 1.8248 1.5243 2.1245 1.2414 1.1939 1.2753 1.1007 1.5306 1.1705 1.0898 1.0850 6.1724 6.1414 1.0711 1.0689 1.0687 1.0682 1.0620 1.0862 1.0880 1.0951 1.0958 1.0943 1.0869 1.0865 1.0922 1.0952 1.1010 1.0736 1.0743 1.0666
irintensity: 0.0408 0.3431 2.6670 2.4904 3.5387 4.0558 1.2289 0.9074 17.6454 5.7350 5.7624 139.1708 18.8345 7.9218 0.6430 0.3070 6.4172 19.8114 2.7890 3.3654 0.8504 36.1039 121.1764 80.7050 63.6723 4.9124 3.9311 0.9162 0.1004 3.8074 26.7850 54.9114 0.2046 0.1988 0.2772 24.9057 0.8104 19.8242 16.6348 16.9899 6.2763 6.2678 6.1811 16.0786 107.4426 15.4218 0.3631 0.5095 13.3634 3.5379 20.9582 6.4082 3.4709 1.0676 10.9167 0.8621 1.9623 2.2537 1.0290 3.4659 0.4697 11.5222 2.9047 69.7183 16.8383 1.7537 8.5336 1.5686 2.7979 5.0868 0.5789 6.9412 80.6917 8.0932 64.6507 201.4833 74.8762 28.0776 5.9337 80.8038 45.4787 59.7140 9.2062 0.6887 28.3657 29.6458 22.1086 2.4955 0.4129 3.5166
temp: 298.150 k
press: 1.00000 atm
elementType: 8 7 7 6 6 6 6 6 6 6 6 6 6 6 1 1 1 1 1 1 1 1 1 1 1 1 1 1 1 1 1 1
symmnumber: 1
zpe: 721772.4 jmol-1
zpe.correction: 0.274909 hartree
zpe.thermalcorrener: 0.290307 hartree
zpe.thermalcorrenthalpy: 0.291251 hartree
zpe.thermalcorrgfe: 0.229331 hartree
zpe.sumelectzpe: -613.559634 hartree
zpe.sumelectthermal: -613.544236 hartree
zpe.sumelectthermalent: -613.543292 hartree
zpe.sumelectthermalfe: -613.605211 hartree
dipole: 0.6960 -1.7567 0.4981
dipole: 1.9541
quadrupole: -75.3519 -84.4865 -85.5438
quadrupole: -9.3840 7.0305 0.6503
quadrupole: 6.4421 -2.6924 -3.7497 -9.3840 7.0305 0.6503
hfenergy: -613.8345426 hartree
pointgroup: C01 [X(C11H18N2O1)]
dipole: 0.2892398 -0.1589884 0.6943595 debye
polarizability: 189.4342008|9.5499387|101.4462362|9.3981861|-19.3446857|114.4965074 unknown
InChI: InChI=1S/C11H18N2O/c14-9-8-12-6-7-13-10-11-4-2-1-3-5-11/h1-5,12-14H,6-10H2
charge 0 multiplicity 1
32 atoms
O  7.10907 0.283879 -0.851854
N  -0.171808 -0.118388 0.205005
N  3.594764 0.188673 0.378205
C  1.167679 -0.07641 0.826279
C  2.25404 0.137089 -0.244606
C  -1.295756 -0.242046 1.158114
C  4.719238 0.281681 -0.578589
C  -2.648574 -0.159124 0.458593
C  6.051839 0.109356 0.158073
C  -2.851506 0.749338 -0.611971
C  -3.731157 -0.968829 0.883533
C  -4.113693 0.849895 -1.23783
C  -4.997167 -0.866677 0.261521
C  -5.192538 0.044266 -0.801967
H  1.181954 0.774096 1.53999
H  1.4232 -0.992562 1.411563
H  2.244711 -0.717504 -0.951927
H  1.996283 1.048776 -0.835529
H  -1.20116 0.596306 1.880297
H  -1.256996 -1.179222 1.768178
H  -0.230155 -0.832417 -0.534673
H  3.643483 0.936453 1.085745
H  4.7493 1.240005 -1.150332
H  4.615947 -0.532781 -1.319445
H  6.088108 -0.896219 0.624336
H  6.145247 0.873877 0.962379
H  -2.005126 1.359892 -0.944348
H  -3.583032 -1.683014 1.703655
H  -4.25789 1.555801 -2.064106
H  -5.825121 -1.499698 0.600944
H  -6.171841 0.12265 -1.287787
H  7.991456 0.107559 -0.440145
