program: Gaussian 09
title: 000104683
version: EM64L-G09RevD.01
frameworkgroup: C1[X(C18H12N2O6)]
method: RPBEPBE
basis: SDD
operation: Freq
keyword: #p
keyword: freq=noraman
keyword: PBEPBE/SDD
title: #p freq=noraman PBEPBE/SDD
converged: YES YES NO NO
title: Mulliken charges:
elementType: O O O O O O N N C C C C C C C C C C C C C C C C C C H H H H H H H H H H H H
charge: -0.299514 -0.300055 -0.202421 -0.192695 -0.201868 -0.225294 0.020083 0.023135 0.360056 0.366274 -0.503159 0.381549 0.371006 -0.401990 -0.405957 -0.159513 -0.517426 -0.447461 0.412350 0.398765 -0.359432 -0.381040 -0.389186 -0.381828 -0.162394 -0.154667 0.313217 0.267483 0.265354 0.239508 0.313049 0.306858 0.275602 0.271413 0.290815 0.290335 0.272246 0.246802
chargesum: 0.00000
title: Mulliken charges with hydrogens summed into heavy atoms:
elementType: O O O O O O N N C C C C C C C C C C C C C C C C C C
charge: -0.299514 -0.300055 -0.202421 -0.192695 -0.201868 -0.225294 0.020083 0.023135 0.360056 0.366274 -0.189942 0.381549 0.371006 -0.134507 -0.140603 0.079995 -0.204377 -0.140603 0.412350 0.398765 -0.083831 -0.109627 -0.098371 -0.091493 0.109852 0.092134
polarizability: 2.73827117e+02 -1.56405085e+01 2.93729116e+02 -1.16054079e+01 -4.63164278e+00 1.60961410e+02
1716.lowfreq: -5.8566 -1.8296 0.0005 0.0006 0.0009 6.4248 16.9175 22.4835 36.8475
frequency: 16.9016 22.4139 36.8382 43.6357 45.5781 55.8839 69.2238 79.8385 150.0997 165.8501 170.0230 179.0268 203.4287 232.7347 233.9544 255.7556 286.1886 312.0237 320.4049 368.7329 389.6726 399.3307 428.2430 432.6139 445.4006 498.1749 503.2815 514.3358 515.7158 549.8315 560.9217 570.8559 597.4458 635.6606 651.5531 658.5749 668.3238 676.7632 685.2356 703.8371 706.8275 713.5602 751.6837 772.8451 793.8953 808.6427 813.8550 868.7242 876.1541 894.9283 906.6063 910.6576 918.2037 930.0603 938.5909 958.1729 975.8334 985.8660 986.4800 987.7250 991.4698 998.9629 1067.1230 1073.4930 1074.5612 1081.7200 1083.9227 1119.5170 1165.5254 1167.1656 1173.5316 1183.6712 1200.5755 1215.5469 1217.2189 1243.8957 1272.6689 1280.0600 1289.1249 1369.4766 1374.0976 1382.9488 1395.4775 1399.1978 1426.1555 1439.1239 1443.0171 1460.1090 1467.1757 1474.6907 1583.9719 1588.6335 1593.0534 1603.6996 1613.0661 1619.4777 3152.1823 3157.0259 3160.0126 3168.1281 3176.8583 3177.8685 3177.9842 3186.2598 3192.9223 3194.3645 3194.8773 3197.3698
redmass: 8.1834 8.9484 6.5019 7.5288 6.7017 10.0027 10.4533 7.9814 7.0716 5.9465 5.9264 6.8644 4.8306 5.0040 4.9174 7.1853 7.7009 5.9931 6.2507 8.0142 8.2992 6.7707 3.2890 3.3385 3.2301 7.6723 7.2158 5.2478 5.8076 5.5713 7.6287 7.6244 6.9316 5.8647 7.6703 6.5396 2.7189 2.8202 2.9719 4.4588 4.4793 5.5133 10.5413 10.3475 1.4446 1.4395 1.4154 5.6647 1.5449 1.4434 1.5660 4.3188 1.4869 1.4017 1.3760 3.6956 1.3253 6.0814 6.1478 5.8524 1.3444 1.3421 1.7282 1.6173 1.6893 1.5132 1.5307 1.7847 1.1312 1.1279 1.1694 3.8425 4.5077 9.9257 10.0151 5.4390 1.3872 1.3988 1.3232 10.5540 10.6459 7.8341 6.9746 7.5781 3.1487 3.2614 3.3418 2.5294 2.6794 2.6507 6.8209 7.2492 6.9017 7.6123 7.0930 7.5284 1.0880 1.0884 1.0886 1.0922 1.0929 1.0940 1.0947 1.0990 1.0946 1.0957 1.0951 1.0923
irintensity: 0.7861 1.3236 1.5207 0.7713 1.9878 0.7743 0.7829 1.0957 0.5118 0.9632 1.5843 2.3610 0.1627 1.7793 0.5483 4.5057 2.2984 3.0891 2.9787 0.7566 0.8851 4.4991 1.4610 2.4428 7.3666 1.5024 1.6147 6.3327 5.0891 2.9844 0.7240 0.4073 0.7363 0.0648 2.4274 14.0757 14.1948 23.3306 14.6098 27.8011 26.2934 13.9551 18.3574 42.5633 70.3873 31.7471 51.9165 6.2462 34.0729 2.0363 9.6741 48.2263 19.7454 6.8294 8.0120 118.8125 1.2580 2.3492 2.4451 0.5897 1.6529 0.4890 12.5268 14.8064 1.5726 23.4709 21.4512 67.4226 2.0799 4.1190 3.5433 18.7964 212.3274 263.6706 338.7115 428.4349 15.4118 38.9387 13.0748 100.4476 113.0930 5.8532 16.6024 23.9089 17.2060 26.0506 15.5220 207.5973 288.7222 46.5810 32.9120 51.9815 93.3059 162.9857 12.6803 11.1799 11.8018 8.6335 4.0722 0.8505 2.3233 1.7853 2.1172 3.2054 2.5111 1.2139 11.5733 5.8379
temp: 298.150 k
press: 1.00000 atm
elementType: 8 8 8 8 8 8 7 7 6 6 6 6 6 6 6 6 6 6 6 6 6 6 6 6 6 6 1 1 1 1 1 1 1 1 1 1 1 1
symmnumber: 1
zpe: 700429.1 jmol-1
zpe.correction: 0.266779 hartree
zpe.thermalcorrener: 0.288139 hartree
zpe.thermalcorrenthalpy: 0.289084 hartree
zpe.thermalcorrgfe: 0.213260 hartree
zpe.sumelectzpe: -1251.969159 hartree
zpe.sumelectthermal: -1251.947799 hartree
zpe.sumelectthermalent: -1251.946854 hartree
zpe.sumelectthermalfe: -1252.022678 hartree
dipole: -7.0554 2.8605 0.3398
dipole: 7.6209
quadrupole: -170.0546 -147.8523 -149.8180
quadrupole: 3.9939 -19.0385 -12.3972
quadrupole: -14.1463 8.0560 6.0902 3.9939 -19.0385 -12.3972
hfenergy: -1252.2359381 hartree
pointgroup: C01 [X(C18H12N2O6)]
dipole: 2.8816203 0.6450391 -0.5194767 debye
polarizability: 274.9150365|17.3739386|288.4311329|-25.5408377|-1.9232144|165.1714731 unknown
InChI: InChI=1S/C18H12N2O6/c21-19(22)13-4-1-6-15(10-13)25-17-8-3-9-18(12-17)26-16-7-2-5-14(11-16)20(23)24/h1-12H
charge 0 multiplicity 1
38 atoms
O  -1.343601 2.582629 0.330667
O  3.020657 0.958121 -1.346435
O  -6.004668 -1.21038 0.052975
O  1.570014 -4.339824 1.2787
O  -5.866741 0.872212 -0.865076
O  0.931265 -2.277741 2.008213
N  -5.371714 -0.112952 -0.193684
N  1.536931 -3.056575 1.169106
C  0.062803 2.673869 0.180595
C  2.201179 1.881036 -0.634737
C  0.811106 1.681133 -0.490243
C  -1.9732 1.335212 0.555497
C  2.871966 -0.431733 -1.180745
C  0.665653 3.859864 0.652495
C  2.836019 3.0525 -0.174481
C  2.051745 4.043091 0.458252
C  -3.285364 1.21651 0.058093
C  2.266907 -1.025297 -0.053163
C  -3.98492 0.022919 0.327063
C  2.218626 -2.433154 0.005855
C  -1.380982 0.292752 1.310615
C  3.438317 -1.233809 -2.20208
C  -3.423412 -1.04456 1.061398
C  2.771293 -3.263898 -0.991566
C  -2.109101 -0.89343 1.550653
C  3.389051 -2.639561 -2.097324
H  0.321339 0.795128 -0.903311
H  0.048969 4.609825 1.154561
H  3.912855 3.172955 -0.317991
H  2.529429 4.960215 0.817088
H  -3.748199 2.022684 -0.515058
H  1.847423 -0.43869 0.765795
H  -0.373115 0.401943 1.720261
H  3.907292 -0.740765 -3.058361
H  -4.009685 -1.949431 1.236387
H  2.706923 -4.349973 -0.895113
H  -1.635956 -1.69531 2.125253
H  3.827894 -3.253312 -2.889857
