program: Gaussian 09
title: 000104651
version: EM64L-G09RevD.01
frameworkgroup: C1[X(C13H24ClNO4)]
method: RPBEPBE
basis: SDD
operation: Freq
keyword: #p
keyword: freq=noraman
keyword: PBEPBE/SDD
title: #p freq=noraman PBEPBE/SDD
converged: YES YES NO NO
title: Mulliken charges:
elementType: Cl O O O O N C C C C C C C C C C C C C H H H H H H H H H H H H H H H H H H H H H H H H
charge: -0.073707 -0.265747 -0.264379 -0.247561 -0.248290 -0.115857 -0.344298 -0.364247 -0.370665 -0.329961 -0.508845 -0.508466 -0.586791 0.251945 0.252194 -0.228074 -0.227934 -0.671588 -0.671928 0.193341 0.202772 0.206705 0.238151 0.211619 0.234983 0.225055 0.236447 0.258837 0.237424 0.258608 0.245449 0.259505 0.256507 0.228106 0.229081 0.228157 0.228086 0.230695 0.229670 0.212483 0.230201 0.230764 0.211552
chargesum: 0.00000
title: Mulliken charges with hydrogens summed into heavy atoms:
elementType: Cl O O O O N C C C C C C C C C C C C C
charge: -0.073707 -0.265747 -0.264379 -0.247561 -0.248290 -0.115857 0.051815 0.080609 0.075937 0.131541 -0.012584 -0.004409 -0.070779 0.251945 0.252194 0.229114 0.228309 0.001260 0.000589
polarizability: 1.99565100e+02 -3.75177838e-01 1.89238978e+02 -1.12833606e+00 -3.02827729e+00 1.34481910e+02
1716.lowfreq: -18.7728 -3.3726 -0.0015 -0.0011 0.0019 1.1041 5.4888 14.1621 18.3323
frequency: -18.0458 14.0376 18.3269 23.6429 29.1930 43.2557 49.9592 54.2181 61.5810 69.0803 86.9246 99.5551 110.4710 140.5493 154.1213 158.6191 177.9244 199.2578 203.2469 229.2441 249.9898 252.3877 269.3513 304.2504 336.7272 343.9532 373.7411 404.3552 449.5444 476.7765 494.1655 562.4921 569.6881 662.6633 690.0251 694.1422 761.1348 779.9320 782.0578 796.5188 799.0403 800.2184 811.7412 842.9413 861.4510 918.7364 920.3926 1007.3202 1015.0803 1021.0909 1024.7971 1036.6197 1049.2419 1060.9347 1068.8838 1071.5384 1104.0747 1110.4754 1113.3611 1117.5225 1134.7624 1135.3809 1138.4226 1144.2673 1179.6731 1216.3722 1217.7601 1246.0929 1247.9129 1248.9770 1271.9562 1277.1599 1291.7019 1294.4269 1308.4373 1310.0661 1322.9489 1355.5197 1356.4147 1372.3765 1377.9328 1390.1493 1399.4206 1400.7223 1443.1211 1445.6985 1458.9193 1463.1353 1463.2083 1471.2915 1473.4235 1474.4954 1476.2664 1477.8036 1486.2400 1486.5178 1487.2560 1633.3380 1634.1491 2859.6934 2883.8616 2898.8538 2995.7547 2995.8292 3001.7447 3003.4278 3009.6297 3009.9574 3014.0954 3022.9921 3045.9133 3053.4081 3055.1115 3067.9170 3068.2209 3072.8707 3076.9528 3077.1863 3092.3447 3092.5926 3107.2411 3107.6432 3127.5492
redmass: 3.2486 4.9661 4.8770 8.0631 4.5563 4.3772 3.4565 2.9596 2.2551 2.1429 2.9966 3.5835 3.2322 3.2412 1.9294 2.0072 5.3514 3.0780 3.1030 3.4407 1.3226 1.3410 3.7989 3.7645 4.2095 3.8755 3.6392 3.9382 3.4370 3.1404 2.9982 2.9951 3.0720 6.7908 5.6477 4.8265 1.0937 1.4678 1.4024 1.1493 1.1043 2.7417 3.2427 1.4101 3.4041 5.4494 5.2766 2.5626 2.2883 2.3137 2.3348 2.5709 1.9073 2.5103 3.0419 2.9616 1.9146 2.2324 2.2119 2.0880 1.5213 1.5859 2.2903 2.4148 1.2987 1.6414 1.7715 1.2282 1.1392 1.1359 1.2104 1.1647 1.3196 1.1751 1.4621 1.4494 1.3518 1.3824 1.3909 1.3550 1.4347 1.4760 1.2704 1.2696 1.0878 1.0829 1.0981 1.0402 1.0404 1.0791 1.0603 1.0588 1.0907 1.0814 1.0897 1.0688 1.0708 9.6770 9.6733 1.0710 1.0721 1.0714 1.0359 1.0358 1.0626 1.0622 1.0581 1.0582 1.0635 1.0842 1.0564 1.0900 1.0900 1.1066 1.1066 1.0977 1.0975 1.0999 1.0985 1.0986 1.1026 1.1026 1.1111
irintensity: 0.5550 1.0979 0.3218 0.4404 0.6443 1.0708 0.6077 0.8190 0.2394 2.2748 0.8463 1.4774 0.6086 0.6964 6.3572 4.6837 1.8802 5.6105 10.3288 1.4457 2.2850 1.0907 3.7957 13.2896 1.0165 14.1196 7.2032 2.6922 11.6251 5.9970 10.3359 3.5920 3.3060 10.4526 38.1854 9.0519 8.3392 8.9429 6.7298 4.1329 3.4743 3.7070 5.0498 3.4226 16.9427 42.5816 19.4471 10.4525 3.1095 34.7245 166.6938 40.5353 22.7197 8.8130 38.2376 13.1456 63.0752 14.6228 10.2788 23.5833 10.0060 58.2213 160.3961 385.3556 17.9557 19.5219 19.4489 12.6892 0.3445 0.0867 8.1364 10.2188 16.9517 3.7803 63.9523 109.0277 36.7622 0.1105 0.2087 22.1476 54.1970 9.8087 17.8321 16.6031 20.8033 14.4605 2.4000 11.8758 12.2452 2.4698 5.3643 4.7290 10.7766 10.6713 10.8454 14.3657 14.4855 154.8836 176.5625 65.6324 56.4452 107.2410 23.0409 19.7807 7.9969 9.4346 19.6596 19.6106 6.1561 27.5131 31.8266 1.9116 2.4844 7.5307 7.4416 13.2875 33.6558 23.8715 31.1082 29.8737 43.6995 44.9595 27.8184
temp: 298.150 k
press: 1.00000 atm
elementType: 17 8 8 8 8 7 6 6 6 6 6 6 6 6 6 6 6 6 6 1 1 1 1 1 1 1 1 1 1 1 1 1 1 1 1 1 1 1 1 1 1 1 1
symmnumber: 1
zpe: 943178.2 jmol-1
zpe.correction: 0.359238 hartree
zpe.thermalcorrener: 0.382393 hartree
zpe.thermalcorrenthalpy: 0.383338 hartree
zpe.thermalcorrgfe: 0.300412 hartree
zpe.sumelectzpe: -1323.944442 hartree
zpe.sumelectthermal: -1323.921286 hartree
zpe.sumelectthermalent: -1323.920342 hartree
zpe.sumelectthermalfe: -1324.003268 hartree
dipole: 2.3261 -2.4930 0.1452
dipole: 3.4128
quadrupole: -101.7038 -138.4574 -122.9653
quadrupole: 11.1712 3.5184 10.7574
quadrupole: 19.3383 -17.4152 -1.9231 11.1712 3.5184 10.7574
hfenergy: -1324.3036796 hartree
pointgroup: C01 [X(C13H24Cl1N1O4)]
dipole: -0.8686391 1.0209321 0.0772537 debye
polarizability: 199.4734311|-0.9443297|189.0826881|1.9236124|4.5242946|134.7298691 unknown
InChI: InChI=1S/C13H24ClNO4/c1-3-18-12(16)6-10-15(9-5-8-14)11-7-13(17)19-4-2/h3-11H2,1-2H3
charge 0 multiplicity 1
43 atoms
Cl 0.347287 -6.035196 -1.092616
O  -4.384144 1.2270 -0.446185
O  3.991142 1.786094 -0.445962
O  -2.735573 2.485853 0.615371
O  4.217947 -0.170862 0.798692
N  -0.036067 -0.899309 0.293857
C  -0.47433 -2.270204 0.664052
C  -1.000213 0.154042 0.701221
C  1.356091 -0.604526 0.72107
C  0.077212 -3.337752 -0.314103
C  -2.204221 0.232572 -0.260054
C  2.036688 0.410654 -0.218988
C  -0.32252 -4.747154 0.123969
C  -3.090175 1.431203 0.036781
C  3.504443 0.607298 0.121599
C  -5.340192 2.366818 -0.268909
C  5.445747 2.070494 -0.230732
C  -6.652468 1.946779 -0.921967
C  5.750899 3.373874 -0.961285
H  -0.178435 -2.526916 1.712886
H  -1.579968 -2.301182 0.635346
H  -1.361658 0.009063 1.748543
H  -0.489752 1.132151 0.685875
H  1.398564 -0.231982 1.772563
H  1.944298 -1.537744 0.7018
H  1.179255 -3.271807 -0.367823
H  -0.309719 -3.127586 -1.326874
H  -1.819267 0.330403 -1.294068
H  -2.821862 -0.682112 -0.24366
H  1.96571 0.034975 -1.258322
H  1.533385 1.393442 -0.211676
H  0.104665 -5.026233 1.099913
H  -1.413368 -4.899148 0.128469
H  -5.446554 2.561874 0.813593
H  -4.899335 3.265414 -0.737279
H  5.626842 2.139883 0.857148
H  6.02803 1.216417 -0.621655
H  -6.510343 1.74266 -1.996923
H  -7.058121 1.037695 -0.445983
H  -7.397942 2.756142 -0.81732
H  5.542152 3.278782 -2.04055
H  5.141905 4.202345 -0.561055
H  6.817864 3.633188 -0.834458
